{"text_format":"1","workbook":"xlsx","n_sheets":4,"sheets":["Responsible Sourcing Calculator","Ark2","Dialogboks1","Schedule of changes"],"not_rendered":{"charts":0,"images":6,"macros":1,"external_links":6,"defined_names":665,"comments":0,"pivot_tables":0},"unopened":[{"sheet":"Dialogboks1","index":2,"reason":"not_a_worksheet"}],"bounds":{"document_bytes":16777216,"sheet_cells":100000,"rows_first":2000,"rows_last":500,"rows_between":2000,"halvings":0,"cell_chars":16384,"cell_head_chars":4096},"cells_cut":0,"cells_raw":0,"read":"whole","date_system":"1900"}

{"sheet":"Responsible Sourcing Calculator","index":0,"n_rows":1259,"n_cols":22,"rows_kept":1259,"cut":false,"hidden":false,"merged":[[1175,2,1182,3],[932,12,940,12],[952,12,960,12],[972,12,980,12],[993,12,1001,12],[1013,12,1021,12],[1033,12,1041,12],[1053,12,1061,12],[1154,3,1154,14],[1126,6,1127,6],[1112,2,1112,4],[1106,6,1107,6],[940,4,940,5],[748,2,748,4],[730,13,737,14],[747,2,747,4],[778,4,778,5],[791,13,798,14],[839,4,839,5],[818,7,818,10],[859,7,859,10],[849,2,849,4],[769,3,769,14],[829,2,829,4],[830,3,830,14],[798,4,798,5],[831,2,838,3],[828,2,828,4],[811,13,818,14],[778,7,778,10],[789,3,789,14],[689,12,697,12],[546,3,546,14],[688,3,688,14],[670,13,677,14],[709,12,717,12],[729,12,737,12],[750,12,758,12],[717,4,717,5],[758,7,758,10],[701,6,702,6],[727,2,727,4],[741,6,742,6],[690,13,697,14],[681,6,682,6],[565,2,565,4],[585,2,585,4],[586,2,586,4],[677,7,677,10],[689,2,696,3],[627,3,627,14],[656,7,656,10],[616,4,616,5],[749,3,749,14],[729,2,736,3],[9,10,9,12],[8,2,9,5],[10,10,10,12],[11,10,11,12],[1173,2,1173,4],[1193,2,1193,4],[1213,2,1213,4],[504,2,504,4],[19,2,19,4],[20,3,20,14],[255,6,256,6],[114,6,115,6],[170,7,170,10],[89,7,89,10],[15,9,16,9],[649,13,656,14],[648,2,655,3],[292,4,292,5],[100,2,100,4],[110,7,110,10],[102,2,109,3],[183,2,190,3],[201,2,201,4],[221,2,221,4],[822,6,823,6],[818,4,818,5],[808,2,808,4],[809,3,809,14],[843,6,844,6],[839,7,839,10],[850,3,850,14],[832,13,839,14],[751,13,758,14],[758,4,758,5],[770,2,777,3],[750,2,757,3],[802,6,803,6],[810,2,817,3],[810,12,818,12],[831,12,839,12],[950,2,950,4],[1113,3,1113,14],[1086,6,1087,6],[1102,4,1102,5],[1093,3,1093,14],[1082,7,1082,10],[1095,13,1102,14],[1033,2,1040,3],[960,7,960,10],[953,13,960,14],[1094,2,1101,3],[1092,2,1092,4],[1013,2,1020,3],[1054,13,1061,14],[1082,4,1082,5],[1031,2,1031,4],[1053,2,1060,3],[1032,3,1032,14],[1025,6,1026,6],[1065,6,1066,6],[1075,13,1082,14],[970,2,970,4],[994,13,1001,14],[971,3,971,14],[913,13,920,14],[930,2,930,4],[912,2,919,3],[932,2,939,3],[931,3,931,14],[879,7,879,10],[859,4,859,5],[870,3,870,14],[871,2,878,3],[872,13,879,14],[899,4,899,5],[899,7,899,10],[883,6,884,6],[891,2,898,3],[852,13,859,14],[851,2,858,3],[911,3,911,14],[892,13,899,14],[889,2,889,4],[920,4,920,5],[851,12,859,12],[871,12,879,12],[891,12,899,12],[912,12,920,12],[357,6,358,6],[262,2,262,4],[384,3,384,14],[403,2,403,4],[423,2,423,4],[123,13,130,14],[101,3,101,14],[41,12,49,12],[61,12,69,12],[69,4,69,5],[324,12,332,12],[345,12,353,12],[365,12,373,12],[385,12,393,12],[405,12,413,12],[393,4,393,5],[332,7,332,10],[377,6,378,6],[345,2,352,3],[346,13,353,14],[282,2,282,4],[264,2,271,3],[342,2,342,4],[14,13,16,13],[292,7,292,10],[242,3,242,14],[263,3,263,14],[1227,6,1228,6],[1214,3,1214,14],[1223,4,1223,5],[1223,7,1223,10],[1203,7,1203,10],[1195,2,1202,3],[1207,6,1208,6],[1187,6,1188,6],[1194,3,1194,14],[1196,13,1203,14],[1203,4,1203,5],[1195,12,1203,12],[1215,12,1223,12],[1215,2,1222,3],[1216,13,1223,14],[1176,13,1183,14],[1183,4,1183,5],[1152,2,1152,4],[1115,13,1122,14],[1133,3,1133,14],[1114,2,1121,3],[1122,4,1122,5],[1153,2,1153,4],[1146,6,1147,6],[1155,2,1162,3],[1163,4,1163,5],[1167,6,1168,6],[1174,3,1174,14],[1135,13,1142,14],[1122,7,1122,10],[1156,13,1163,14],[1163,7,1163,10],[1142,7,1142,10],[1134,2,1141,3],[1114,12,1122,12],[1134,12,1142,12],[1155,12,1163,12],[1175,12,1183,12],[1183,7,1183,10],[697,7,697,10],[568,13,575,14],[588,12,596,12],[608,12,616,12],[628,12,636,12],[697,4,697,5],[677,4,677,5],[669,2,676,3],[519,6,520,6],[647,3,647,14],[545,2,545,4],[535,4,535,5],[555,4,555,5],[579,6,580,6],[616,7,616,10],[547,2,554,3],[527,2,534,3],[555,7,555,10],[525,2,525,4],[527,12,535,12],[547,12,555,12],[567,12,575,12],[648,12,656,12],[669,12,677,12],[204,13,211,14],[140,2,140,4],[203,2,210,3],[181,2,181,4],[609,13,616,14],[539,6,540,6],[548,13,555,14],[535,7,535,10],[575,7,575,10],[566,3,566,14],[567,2,574,3],[508,13,515,14],[515,7,515,10],[487,13,494,14],[467,13,474,14],[478,6,479,6],[484,2,484,4],[494,7,494,10],[507,2,514,3],[505,2,505,4],[498,6,499,6],[474,7,474,10],[506,3,506,14],[485,3,485,14],[162,12,170,12],[183,12,191,12],[203,12,211,12],[223,12,231,12],[73,6,74,6],[243,2,250,3],[184,13,191,14],[163,13,170,14],[191,7,191,10],[195,6,196,6],[180,2,180,4],[162,2,169,3],[211,4,211,5],[174,6,175,6],[231,7,231,10],[182,3,182,14],[170,4,170,5],[241,2,241,4],[235,6,236,6],[231,4,231,5],[223,2,230,3],[81,12,89,12],[102,12,110,12],[224,13,231,14],[93,6,94,6],[69,7,69,10],[80,3,80,14],[39,2,39,4],[79,2,79,4],[161,3,161,14],[160,2,160,4],[154,6,155,6],[143,13,150,14],[142,12,150,12],[53,6,54,6],[82,13,89,14],[62,13,69,14],[33,6,34,6],[40,3,40,14],[15,11,16,11],[15,7,16,7],[15,10,16,10],[29,4,29,5],[15,8,16,8],[89,4,89,5],[14,6,16,6],[49,4,49,5],[14,7,14,11],[21,2,28,3],[41,2,48,3],[14,14,16,14],[17,2,17,5],[251,4,251,5],[276,6,277,6],[322,2,322,4],[142,2,149,3],[120,2,120,4],[59,2,59,4],[61,2,68,3],[14,2,16,3],[14,4,16,5],[18,2,18,4],[110,4,110,5],[283,3,283,14],[265,13,272,14],[272,4,272,5],[122,12,130,12],[243,12,251,12],[264,12,272,12],[284,12,292,12],[304,12,312,12],[261,2,261,4],[272,7,272,10],[49,7,49,10],[99,2,99,4],[60,3,60,14],[366,13,373,14],[434,7,434,10],[444,2,444,4],[424,2,424,4],[446,12,454,12],[466,12,474,12],[486,12,494,12],[507,12,515,12],[454,7,454,10],[413,4,413,5],[445,3,445,14],[434,4,434,5],[426,12,434,12],[465,3,465,14],[446,2,453,3],[464,2,464,4],[426,2,433,3],[427,13,434,14],[710,13,717,14],[771,13,778,14],[365,2,372,3],[373,7,373,10],[798,7,798,10],[768,2,768,4],[782,6,783,6],[737,4,737,5],[721,6,722,6],[737,7,737,10],[788,2,788,4],[790,2,797,3],[728,3,728,14],[762,6,763,6],[770,12,778,12],[790,12,798,12],[515,4,515,5],[417,6,418,6],[486,2,493,3],[526,3,526,14],[466,2,473,3],[474,4,474,5],[413,7,413,10],[406,13,413,14],[1001,7,1001,10],[920,7,920,10],[924,6,925,6],[863,6,864,6],[944,6,945,6],[890,3,890,14],[940,7,940,10],[973,13,980,14],[933,13,940,14],[992,3,992,14],[993,2,1000,3],[910,2,910,4],[952,2,959,3],[990,2,990,4],[964,6,965,6],[909,2,909,4],[869,2,869,4],[879,4,879,5],[991,2,991,4],[1001,4,1001,5],[980,4,980,5],[980,7,980,10],[960,4,960,5],[903,6,904,6],[1071,2,1071,4],[1061,7,1061,10],[1142,4,1142,5],[1102,7,1102,10],[1005,6,1006,6],[1073,3,1073,14],[1052,3,1052,14],[1014,13,1021,14],[1034,13,1041,14],[1041,7,1041,10],[1021,7,1021,10],[1045,6,1046,6],[1041,4,1041,5],[1132,2,1132,4],[1061,4,1061,5],[1051,2,1051,4],[1074,2,1081,3],[1011,2,1011,4],[1021,4,1021,5],[1072,2,1072,4],[1012,3,1012,14],[1074,12,1082,12],[1094,12,1102,12],[972,2,979,3],[984,6,985,6],[559,6,560,6],[620,6,621,6],[646,2,646,4],[717,7,717,10],[660,6,661,6],[667,2,667,4],[668,3,668,14],[666,2,666,4],[656,4,656,5],[709,2,716,3],[708,3,708,14],[636,4,636,5],[606,2,606,4],[600,6,601,6],[640,6,641,6],[607,3,607,14],[596,7,596,10],[629,13,636,14],[588,2,595,3],[687,2,687,4],[951,3,951,14],[707,2,707,4],[608,2,615,3],[393,7,393,10],[528,13,535,14],[575,4,575,5],[596,4,596,5],[636,7,636,10],[589,13,596,14],[626,2,626,4],[397,6,398,6],[494,4,494,5],[454,4,454,5],[404,3,404,14],[405,2,412,3],[628,2,635,3],[587,3,587,14],[447,13,454,14],[458,6,459,6],[438,6,439,6],[425,3,425,14],[323,3,323,14],[324,2,331,3],[304,2,311,3],[285,13,292,14],[302,2,302,4],[284,2,291,3],[296,6,297,6],[386,13,393,14],[385,2,392,3],[373,4,373,5],[332,4,332,5],[343,2,343,4],[353,7,353,10],[312,7,312,10],[303,3,303,14],[364,3,364,14],[325,13,332,14],[344,3,344,14],[336,6,337,6],[312,4,312,5],[363,2,363,4],[353,4,353,5],[316,6,317,6],[383,2,383,4],[1,5,1,9],[21,12,29,12],[14,12,16,12],[305,13,312,14],[121,3,121,14],[150,4,150,5],[29,7,29,10],[42,13,49,14],[22,13,29,14],[81,2,88,3],[122,2,129,3],[134,6,135,6],[130,7,130,10],[130,4,130,5],[141,3,141,14],[150,7,150,10],[103,13,110,14],[191,4,191,5],[211,7,211,10],[202,3,202,14],[215,6,216,6],[244,13,251,14],[222,3,222,14],[251,7,251,10]]}
[]
[null,null,null,null,null,"Mat 5 – kalkulator for ansvarlig innkjøp av materialer",null,null,null,null,null,null,null,null,"Versjon 1.1",null,null,null,"- Velg -",1,"- Velg -",1]
[null,null,null,null,null,null,null,null,null,null,null,null,null,null,null,null,null,null,"Nybygg- og/eller større renoveringsprosjekter",2,"Varehandel",2]
[null,null,null,null,null,null,null,null,null,null,null,null,null,null,null,null,null,null,"Kun innredning",3,"Kontor"]
[null,null,null,null,null,null,null,null,null,null,null,null,null,null,null,null,null,null,null,null,"Industri"]
[null,null,null,null,null,null,null,null,null,null,null,null,null,null,null,null,null,null,1,null,"Utdanning"]
[]
[]
[null,null,"Bruk rullegardinmenyene og velg relevant vurderingstype og bygningskategori. \nKlikk deretter på «Velg»-knappen."]
[null,null,null,null,null,null,"Antall poeng tilgjengelig","Nødvendige områdepoeng",null,null,"Antall bygningselementer:",null,null,{"$f":"IF(asstype=1,0,D1239)","v":0},null,null,null,null,null,null,null," "]
[null,null,"Vurderingstype:",null,null,null,{"$f":"IF(E1236=7,1,IF(E1237=7,1,\"\"))","v":""},{"$f":"IF(D1239=0,\"\",G1243)","v":""},null,null,"Totalt oppnådde områdepoeng",null,null,{"$f":"IF(N10=0,0,IF(O19+O100+O181+O262+O343+O424+O505+O586+O667+O748+O829+O910+O991+O1072+O1153=0,0,O19+O100+O181+O262+O343+O424+O505+O586+O667+O748+O829+O910+O991+O1072+O1153))","v":0}]
[null,null,"BREEAM-system:",null,null,null,{"$f":"IF(E1236=7,2,\"\")","v":""},{"$f":"IF(D1239=0,\"\",G1244)","v":""},null,null,"TOTALT OPPNÅDDE POENG",null,null,{"$f":"IF(N11=0,0,IF(N11<5,0,IF(asstype=2,VLOOKUP(N11,F1242:H1244,3,TRUE),IF(asstype=3,VLOOKUP(N11,F1242:H1244,3,TRUE),0))))","v":0},null,null,null,null,null,null,1]
[]
[]
[null,null,"BYGNINGSELEMENT",null,"MATERIALTYPER",null,"RELEVANTE MATERIALERS \nPROSENT/VOLUM","Prosentandel/volum av relevante materialer i \nsamsvar med hvert nivå",null,null,null,null,"Område-\npoeng","% av vurderte materialer","Områdepoeng pr. bygningselement",null,null,{"$f":"IF(asstype=1,1,0)","v":1},null,"Quantity of types selected","Data type selected","Averaging  Value"]
[null,null,null,null,null,null,null,"Nivå 1","N/A","Nivå 2","Nivå 3","Nivå 4",null,null,null,null,null,{"$f":"IF(asstype=1,1,0)","v":1}]
[null,null,null,null,null,null,null,null,null,null,null,null,null,null,null,null,null,{"$f":"IF(asstype=1,1,0)","v":1}]
[null,null,null,null,null,null,null,3,2.5,2,1.5,1,null,null,null,null,null,1]
[null,null,"BÆREKONSTRUKSJON",null,null,"Velg antall bærekonstruksjoner du ønsker å vurdere (deretter trykk «velg»):",null,null,null,null,{"$f":"IF(AND(G19=\"\",G30>0),\"NB! Husk å velge antall elementer...\",\"\")","v":""},null,null,null,{"$f":"IF(ISERROR(O31+O51+O71+O91)/V21,\"\",(O31+O51+O71+O91)/V21)","v":0},null,{"$f":"0","v":0},{"$f":"IF(asstype=2,0,1)","v":1},null,{"$f":"VLOOKUP(G19,$T$1239:$U$1243,2,FALSE)","v":2}]
[null,null,{"$f":"IF(G19=\"\",\"BÆREKONSTRUKSJON\",\"BÆREKONSTRUKSJON (1)\")","v":"BÆREKONSTRUKSJON"},null,null,"Velg datatype:","Volum",null,null,null,null,null,null,null,null,null,{"$f":"IF(freq1>=3,0,1)","v":1},{"$f":"IF(asstype=2,0,1)","v":1}]
[null,null,null,{"$f":"IF(AND(P31>=1,type1=1),\"NB! Volum av nivåene kan ikke være større enn det totale volumet for hvert enkelt materiale!\",+IF(AND(P31>=1,type1=2),\"NB! Prosentandel for hvert nivå må registreres i prosent av det vurderte bygningselementet, og den totale prosentandelen kan ikke være større enn den totale prosent av hvert enkelt materiale!\",\"\"))","v":""},null,null,null,null,null,null,null,null,null,null,null,null,1,{"$f":"IF(asstype=2,0,1)","v":1},null,null,{"$f":"IF(Volum=\"\",2,IF(ISERROR(VLOOKUP(G20,$T$1246:$U$1247,2,FALSE)),\"\",VLOOKUP(G20,$T$1246:$U$1247,2,FALSE)))","v":1},{"$f":"IF(freq1=3,1,IF(freq1=4,2,IF(freq1=5,3,IF(freq1=6,4,1))))","v":1}]
[null,null,{"$f":"IF(G20=\"\",\"\",IF(SUM(G22:G29)=0,\"\",IF(U21=1,IF(U20+L30=1,\"REGISTRER DET TOTALE VOLUMET AV RELEVANTE MATERIALER\",IF((U21+G30+L30)=1,\"REGISTRER DET TOTALE VOLUMET AV RELEVANTE MATERIALER\",IF(ISERROR(C31),\"REGISTRER DET TOTALE VOLUMET AV RELEVANTE MATERIALER\",IF(OR(G22>L30,G23>L30,G24>L30,G25>L30,G26>L30,G27>L30,G28>L30,G29>L30),\"Volumet av de enkelte materialer kan ikke overstige mengden relevante materialer\",IF(SUM(G22:G29)>L30,\"Den totale mengden av materialer kan ikke overstige det  totale volumet av relevante materialer\",\"\"))))),IF(U21=2,IF(SUM(G22:G29)<80,\"Minst 80 % av de relevante materialer må vurderes, vennligst beregn på nytt.\",IF(OR(G22>100,G23>100,G24>100,G25>100,G26>100,G27>100,G28>100,G29>100),\"Prosentandel av de enkelte materialerer kan ikke overstige 100\",IF(SUM(G22:G29)>100,\"Den totale prosentandelen av materialer kan ikke overstige 100\",\"\")))))))","v":""},null,"Mat. 1",null,null,null,null,null,null,null,{"$f":"IF(SUM(H38+I38+J38+K38+L38)>=3,\"3,00\",SUM(H38+I38+J38+K38+L38))","v":0},{"$f":"IF(AND(U20=1,L30=\"\"),0,IF(OR(NOT(D21=\"\"),NOT(C22=\"\"),NOT(N23=\"\")),0,IF(ISERROR(N31),\"0\",N31)))","v":0},null,{"$f":"IF(SUM(H22:L22)>G22,\"1\",\"0\")","v":"0"},1,1]
[null,null,null,null,"Mat. 2",null,null,null,null,null,null,null,null,{"$f":"IF(AND(U21=1,L30=\"\"),C22,+IF(G31>L30,C22,(IF(N31<80,\"Ingen poeng oppnådd,\nmindre enn 80 % oppfyller kravet\",\"\"))))","v":""},null,{"$f":"IF(SUM(H23:L23)>G23,\"1\",\"0\")","v":"0"},1,1]
[null,null,null,null,"Mat. 3",null,null,null,null,null,null,null,null,null,null,"0",1,1]
[null,null,null,null,"Mat. 4",null,null,null,null,null,null,null,null,null,null,"0",1,{"$f":"IF(asstype=2,0,1)","v":1}]
[null,null,null,null,"Mat. 5",null,null,null,null,null,null,null,null,null,null,{"$f":"IF(SUM(H26:L26)>G26,\"1\",\"0\")","v":"0"},1,1]
[null,null,null,null,"Mat. 6",null,null,null,null,null,null,null,null,null,null,"0",1,1]
[null,null,null,null,"Mat. 7",null,null,null,null,null,null,null,null,null,null,"0",1,1]
[null,null,null,null,"Mat. 8",null,null,null,null,null,null,null,null,null,null,{"$f":"IF(SUM(H29:L29)>G29,\"1\",\"0\")","v":"0"},1,1]
[null,null,null,null,"Totalt % av bygningselementet (relevante materialer) vurdert:",null,{"$f":"IF(U21=\"\",0,IF(U21+L30=1,0,IF(SUM(G22:G29)=0,0,IF(U21=1,IF(OR(G22>L30,G23>L30,G24>L30,G25>L30,G26>L30,G27>L30,G28>L30,G29>L30,SUM(G22:G29)>L30),0,((SUM(G22:G29)/L30)*100)),IF(U21=2,IF(OR(G22>100,G23>100,G24>100,G25>100,G26>100,G27>100,G28>100,G29>100,SUM(G22:G29)>100),0,SUM(G22:G29)))))))","v":0},"Samlet volum for aktuelle elementer:",null,null,null,null,null,null,null,null,1,1]
[null,null,{"$f":"IF(G30=0,\"0\",IF(U21=2,\"0\",IF(U21=1,(G30/100)*100,IF(U21=2,(G30/100)*100))))","v":"0"},{"$f":"G30","v":0},null,"Totalt",{"$f":"IF(SUM(G22:G29)=0,\"1\",SUM(G22:G29))","v":"1"},{"$f":"SUM(H22:H29)","v":0},{"$f":"SUM(I22:I29)","v":0},{"$f":"SUM(J22:J29)","v":0},{"$f":"SUM(K22:K29)","v":0},{"$f":"SUM(L22:L29)","v":0},null,{"$f":"SUM(H32:L32)","v":0},{"$f":"IF(G30<80,\"0,00\",IF(P31>0,\"0\",IF(G30>100,\"0,00\",IF(N22>=80,M22,IF(N22<80,0)))))","v":"0,00"},{"$f":"P22+P23+P24+P25+P26+P27+P28+P29","v":0},{"$f":"1","v":1},{"$f":"1","v":1}]
[null,null,null,null,null,null,"Percentage",{"$f":"IF(H31+G31=0,\"0\",(H31/G31)*100)","v":0},{"$f":"IF(I31+G31=0,\"0\",(I31/G31)*100)","v":0},{"$f":"IF(J31+G31=0,\"0\",(J31/G31)*100)","v":0},{"$f":"IF(K31+G31=0,\"0\",(K31/G31)*100)","v":0},{"$f":"IF(L31+G31=0,\"0\",(L31/G31)*100)","v":0},null,100,null,null,{"$f":"1","v":1},{"$f":"1","v":1}]
[null,null,null,null,null,{"$f":"IF(U21=1,((G31/100)*80))","v":0.8},"% of 80",{"$f":"(H32/80)*100","v":0},{"$f":"(I32/80)*100","v":0},{"$f":"(J32/80)*100","v":0},{"$f":"(K32/80)*100","v":0},{"$f":"(L32/80)*100","v":0},null,null,null,null,{"$f":"1","v":1},{"$f":"1","v":1}]
[null,null,null,null,null,null,"Limiter",{"$f":"IF(H33>100,\"100\",H33)","v":0},{"$f":"IF(I33>100,\"100\",I33)","v":0},{"$f":"IF(J33>100,\"100\",J33)","v":0},{"$f":"IF(K33>100,\"100\",K33)","v":0},{"$f":"IF(L33>100,\"100\",L33)","v":0},null,null,null,null,{"$f":"1","v":1},{"$f":"1","v":1}]
[null,null,null,null,null,null,null,null,{"$f":"IF(H34+I34+J34+K34+L34=0,0,100-(H34))","v":0},{"$f":"IF(H34+I34+J34+K34+L34=0,0,100-(H34+I34))","v":0},{"$f":"IF(J34+I34+H34+K34+L34=0,0,100-(J34+I34+H34))","v":0},{"$f":"IF(K34+J34+I34+H34+L34=0,0,100-(H34+I34+K34+J34))","v":0},null,null,null,null,{"$f":"1","v":1},{"$f":"1","v":1}]
[null,null,null,null,null,null,null,null,{"$f":"IF(I34>I35,I35,I34)","v":0},{"$f":"IF(J34>J35,J35,J34)","v":0},{"$f":"IF(K34>K35,K35,K34)","v":0},{"$f":"IF(L34>L35,L35,L34)","v":0},null,null,null,null,{"$f":"1","v":1},{"$f":"1","v":1}]
[null,null,null,null,null,null,null,null,null,null,null,{"$f":"IF(K36+J34+H34+I34>=100,0,L36)","v":0},null,null,null,null,{"$f":"1","v":1},{"$f":"1","v":1}]
[null,null,null,null,null,null,"Scores",{"$f":"IF(H31=0,0,0.01*(H34*H39))","v":0},{"$f":"IF(I31=0,0,0.01*(I36*I39))","v":0},{"$f":"IF(J31=0,0,0.01*(J36*J39))","v":0},{"$f":"IF(K31=0,0,0.01*(K36*K39))","v":0},{"$f":"IF(L31=0,0,0.01*(L37*L39))","v":0},null,null,null,null,{"$f":"1","v":1},{"$f":"1","v":1}]
[null,null,null,null,null,null,null,3,2.5,2,1.5,1,"Total",null,null,null,{"$f":"1","v":1},{"$f":"1","v":1}]
[null,null,"BÆREKONSTRUKSJON (2)",null,null,"Velg datatype:",null,null,null,null,null,null,null,null,null,null,{"$f":"IF(freq1>=4,0,1)","v":1},{"$f":"1","v":1},null,null,{"$f":"IF(G40=\"\",2,IF(ISERROR(VLOOKUP(G40,$T$1246:$U$1247,2,FALSE)),\"\",VLOOKUP(G40,$T$1246:$U$1247,2,FALSE)))","v":2}]
[null,null,null,{"$f":"IF(AND(P51>=1,type1=1),\"NB! Volum av nivåene kan ikke være større enn det totale volumet for hvert enkelt materiale!\",+IF(AND(P51>=1,type1=2),\"NB! Prosentandel for hvert nivå må registreres i prosent av det vurderte bygningselementet, og den totale prosentandelen kan ikke være større enn den totale prosent av hvert enkelt materiale!\",\"\"))","v":""},null,null,null,null,null,null,null,null,null,null,null,null,1,{"$f":"1","v":1}]
[null,null,{"$f":"IF(G40=\"\",\"\",IF(SUM(G42:G49)=0,\"\",IF(U40=1,IF(U40+L50=1,\"REGISTRER DET TOTALE VOLUMET AV RELEVANTE MATERIALER\",IF((U40+G50+L50)=1,\"REGISTRER DET TOTALE VOLUMET AV RELEVANTE MATERIALER\",IF(ISERROR(C51),\"REGISTRER DET TOTALE VOLUMET AV RELEVANTE MATERIALER\",IF(OR(G42>L50,G43>L50,G44>L50,G45>L50,G46>L50,G47>L50,G48>L50,G49>L50),\"Volumet av de enkelte materialer kan ikke C22overstige mengden relevante materialer\",IF(SUM(G42:G49)>L50,\"Den totale mengden av materialer kan ikke overstige det  totale volumet av relevante materialer\",\"\"))))),IF(U40=2,IF(SUM(G42:G49)<80,\"Minst 80 % av de relevante materialer må vurderes, vennligst beregn på nytt.\",IF(OR(G42>100,G43>100,G44>100,G45>100,G46>100,G47>100,G48>100,G49>100),\"Prosentandel av de enkelte materialerer kan ikke overstige 100\",IF(SUM(G42:G49)>100,\"Den totale prosentandelen av materialer kan ikke overstige 100\",\"\")))))))","v":""},null,"Mat. 1",null,null,null,null,null,null,null,{"$f":"IF(SUM(H58+I58+J58+K58+L58)>=3,\"3,00\",SUM(H58+I58+J58+K58+L58))","v":0},{"$f":"IF(AND(U40=1,L50=\"\"),0,IF(OR(NOT(D41=\"\"),NOT(C42=\"\"),NOT(N43=\"\")),0,IF(ISERROR(N51),\"0\",N51)))","v":0},null,{"$f":"IF(SUM(H42:L42)>G42,\"1\",\"0\")","v":"0"},1,{"$f":"1","v":1}]
[null,null,null,null,"Mat. 2",null,null,null,null,null,null,null,null,{"$f":"IF(AND(U40=1,L50=\"\"),C42,+IF(G51>L50,C42,(IF(N51<80,\"Ingen poeng oppnådd,\nmindre enn 80 % oppfyller kravet\",\"\"))))","v":""},null,{"$f":"IF(SUM(H43:L43)>G43,\"1\",\"0\")","v":"0"},1,{"$f":"1","v":1}]
[null,null,null,null,"Mat. 3",null,null,null,null,null,null,null,null,null,null,"0",1,{"$f":"1","v":1}]
[null,null,null,null,"Mat. 4",null,null,null,null,null,null,null,null,null,null,"0",1,{"$f":"1","v":1}]
[null,null,null,null,"Mat. 5",null,null,null,null,null,null,null,null,null,null,"0",1,{"$f":"1","v":1}]
[null,null,null,null,"Mat. 6",null,null,null,null,null,null,null,null,null,null,"0",1,{"$f":"1","v":1}]
[null,null,null,null,"Mat. 7",null,null,null,null,null,null,null,null,null,null,"0",1,{"$f":"1","v":1}]
[null,null,null,null,"Mat. 8",null,null,null,null,null,null,null,null,null,null,"0",1,{"$f":"1","v":1}]
[null,null,null,null,"Totalt % av bygningselementet (relevante materialer) vurdert:",null,{"$f":"IF(U40=\"\",0,IF(U40+L50=1,0,IF(SUM(G42:G49)=0,0,IF(U40=1,IF(OR(G42>L50,G43>L50,G44>L50,G45>L50,G46>L50,G47>L50,G48>L50,G49>L50,SUM(G42:G49)>L50),0,((SUM(G42:G49)/L50)*100)),IF(U40=2,IF(OR(G42>100,G43>100,G44>100,G45>100,G46>100,G47>100,G48>100,G49>100,SUM(G42:G49)>100),0,SUM(G42:G49)))))))","v":0},"Samlet volum for aktuelle elementer:",null,null,null,null,null,null,null,null,1,{"$f":"1","v":1}]
[null,null,{"$f":"IF(G50=0,\"0\",IF(U40=2,\"0\",IF(U40=1,(G50/100)*100,IF(U40=2,(G50/100)*100))))","v":"0"},{"$f":"G50","v":0},null,"Total",{"$f":"IF(SUM(G42:G49)=0,\"1\",SUM(G42:G49))","v":"1"},{"$f":"SUM(H42:H49)","v":0},{"$f":"SUM(I42:I49)","v":0},{"$f":"SUM(J42:J49)","v":0},{"$f":"SUM(K42:K49)","v":0},{"$f":"SUM(L42:L49)","v":0},null,{"$f":"SUM(H52:L52)","v":0},{"$f":"IF(G50<80,\"0,00\",IF(P51>0,\"0\",IF(G50>100,\"0,00\",IF(N42>=80,M42,IF(N42<80,0)))))","v":"0,00"},{"$f":"P42+P43+P44+P45+P46+P47+P48+P49","v":0},{"$f":"1","v":1},{"$f":"1","v":1}]
[null,null,null,null,null,null,"Percentage",{"$f":"IF(H51+G51=0,\"0\",(H51/G51)*100)","v":0},{"$f":"IF(I51+G51=0,\"0\",(I51/G51)*100)","v":0},{"$f":"IF(J51+G51=0,\"0\",(J51/G51)*100)","v":0},{"$f":"IF(K51+G51=0,\"0\",(K51/G51)*100)","v":0},{"$f":"IF(L51+G51=0,\"0\",(L51/G51)*100)","v":0},null,100,null,null,{"$f":"1","v":1},{"$f":"1","v":1}]
[null,null,null,null,null,{"$f":"IF(U40=1,((G51/100)*80))","v":false},"% of 80",{"$f":"(H52/80)*100","v":0},{"$f":"(I52/80)*100","v":0},{"$f":"(J52/80)*100","v":0},{"$f":"(K52/80)*100","v":0},{"$f":"(L52/80)*100","v":0},null,null,null,null,{"$f":"1","v":1},{"$f":"1","v":1}]
[null,null,null,null,null,null,"Limiter",{"$f":"IF(H53>100,\"100\",H53)","v":0},{"$f":"IF(I53>100,\"100\",I53)","v":0},{"$f":"IF(J53>100,\"100\",J53)","v":0},{"$f":"IF(K53>100,\"100\",K53)","v":0},{"$f":"IF(L53>100,\"100\",L53)","v":0},null,null,null,null,{"$f":"1","v":1},{"$f":"1","v":1}]
[null,null,null,null,null,null,null,null,{"$f":"IF(H54+I54+J54+K54+L54=0,0,100-(H54))","v":0},{"$f":"IF(H54+I54+J54+K54+L54=0,0,100-(H54+I54))","v":0},{"$f":"IF(J54+I54+H54+K54+L54=0,0,100-(J54+I54+H54))","v":0},{"$f":"IF(K54+J54+I54+H54+L54=0,0,100-(H54+I54+K54+J54))","v":0},null,null,null,null,{"$f":"1","v":1},{"$f":"1","v":1}]
[null,null,null,null,null,null,null,null,{"$f":"IF(I54>I55,I55,I54)","v":0},{"$f":"IF(J54>J55,J55,J54)","v":0},{"$f":"IF(K54>K55,K55,K54)","v":0},{"$f":"IF(L54>L55,L55,L54)","v":0},null,null,null,null,{"$f":"1","v":1},{"$f":"1","v":1}]
[null,null,null,null,null,null,null,null,null,null,null,{"$f":"IF(K56+J54+H54+I54>=100,0,L56)","v":0},null,null,null,null,{"$f":"1","v":1},{"$f":"1","v":1}]
[null,null,null,null,null,null,"Scores",{"$f":"IF(H51=0,0,0.01*(H54*H59))","v":0},{"$f":"IF(I51=0,0,0.01*(I56*I59))","v":0},{"$f":"IF(J51=0,0,0.01*(J56*J59))","v":0},{"$f":"IF(K51=0,0,0.01*(K56*K59))","v":0},{"$f":"IF(L51=0,0,0.01*(L57*L59))","v":0},null,null,null,null,{"$f":"1","v":1},{"$f":"1","v":1}]
[null,null,null,null,null,null,null,3,2.5,2,1.5,1,"Total",null,null,null,{"$f":"1","v":1},{"$f":"1","v":1}]
[null,null,"BÆREKONSTRUKSJON (3)",null,null,"Velg datatype:",null,null,null,null,null,null,null,null,null,null,{"$f":"IF(freq1>=5,0,1)","v":1},{"$f":"1","v":1},null,null,{"$f":"IF(G60=\"\",2,IF(ISERROR(VLOOKUP(G60,$T$1246:$U$1247,2,FALSE)),\"\",VLOOKUP(G60,$T$1246:$U$1247,2,FALSE)))","v":2}]
[null,null,null,{"$f":"IF(AND(P71>=1,type1=1),\"NB! Volum av nivåene kan ikke være større enn det totale volumet for hvert enkelt materiale!\",+IF(AND(P71>=1,type1=2),\"NB! Prosentandel for hvert nivå må registreres i prosent av det vurderte bygningselementet, og den totale prosentandelen kan ikke være større enn den totale prosent av hvert enkelt materiale!\",\"\"))","v":""},null,null,null,null,null,null,null,null,null,null,null,null,1,{"$f":"1","v":1}]
[null,null,{"$f":"IF(G60=\"\",\"\",IF(SUM(G62:G69)=0,\"\",IF(U60=1,IF(U60+L70=1,\"REGISTRER DET TOTALE VOLUMET AV RELEVANTE MATERIALER\",IF((U60+G70+L70)=1,\"REGISTRER DET TOTALE VOLUMET AV RELEVANTE MATERIALER\",IF(ISERROR(C71),\"REGISTRER DET TOTALE VOLUMET AV RELEVANTE MATERIALER\",IF(OR(G62>L70,G63>L70,G64>L70,G65>L70,G66>L70,G67>L70,G68>L70,G69>L70),\"Volumet av de enkelte materialer kan ikke overstige mengden relevante materialer\",IF(SUM(G62:G69)>L70,\"Den totale mengden av materialer kan ikke overstige det  totale volumet av relevante materialer\",\"\"))))),IF(U60=2,IF(SUM(G62:G69)<80,\"Minst 80 % av de relevante materialer må vurderes, vennligst beregn på nytt.\",IF(OR(G62>100,G63>100,G64>100,G65>100,G66>100,G67>100,G68>100,G69>100),\"Prosentandel av de enkelte materialerer kan ikke overstige 100\",IF(SUM(G62:G69)>100,\"Den totale prosentandelen av materialer kan ikke overstige 100\",\"\")))))))","v":""},null,"Mat. 1",null,null,null,null,null,null,null,{"$f":"IF(SUM(H78+I78+J78+K78+L78)>=3,\"3,00\",SUM(H78+I78+J78+K78+L78))","v":0},{"$f":"IF(AND(U60=1,L70=\"\"),0,IF(OR(NOT(D61=\"\"),NOT(C62=\"\"),NOT(N63=\"\")),0,IF(ISERROR(N71),\"0\",N71)))","v":0},null,{"$f":"IF(SUM(H62:L62)>G62,\"1\",\"0\")","v":"0"},1,{"$f":"1","v":1}]
[null,null,null,null,"Mat. 2",null,null,null,null,null,null,null,null,{"$f":"IF(AND(U60=1,L70=\"\"),C62,+IF(G71>L70,C62,(IF(N71<80,\"Ingen poeng oppnådd,\nmindre enn 80 % oppfyller kravet\",\"\"))))","v":""},null,{"$f":"IF(SUM(H63:L63)>G63,\"1\",\"0\")","v":"0"},1,{"$f":"1","v":1}]
[null,null,null,null,"Mat. 3",null,null,null,null,null,null,null,null,null,null,"0",1,{"$f":"1","v":1}]
[null,null,null,null,"Mat. 4",null,null,null,null,null,null,null,null,null,null,"0",1,{"$f":"1","v":1}]
[null,null,null,null,"Mat. 5",null,null,null,null,null,null,null,null,null,null,"0",1,{"$f":"1","v":1}]
[null,null,null,null,"Mat. 6",null,null,null,null,null,null,null,null,null,null,"0",1,{"$f":"1","v":1}]
[null,null,null,null,"Mat. 7",null,null,null,null,null,null,null,null,null,null,"0",1,{"$f":"1","v":1}]
[null,null,null,null,"Mat. 8",null,null,null,null,null,null,null,null,null,null,"0",1,{"$f":"1","v":1}]
[null,null,null,null,"Totalt % av bygningselementet (relevante materialer) vurdert:",null,{"$f":"IF(U60=\"\",0,IF(U60+L70=1,0,IF(SUM(G62:G69)=0,0,IF(U60=1,IF(OR(G62>L70,G63>L70,G64>L70,G65>L70,G66>L70,G67>L70,G68>L70,G69>L70,SUM(G62:G69)>L70),0,((SUM(G62:G69)/L70)*100)),IF(U60=2,IF(OR(G62>100,G63>100,G64>100,G65>100,G66>100,G67>100,G68>100,G69>100,SUM(G62:G69)>100),0,SUM(G62:G69)))))))","v":0},"Samlet volum for aktuelle elementer:",null,null,null,null,null,null,null,null,1,{"$f":"1","v":1}]
[null,null,{"$f":"IF(G70=0,\"0\",IF(U60=2,\"0\",IF(U60=1,(G70/100)*100,IF(U60=2,(G70/100)*100))))","v":"0"},{"$f":"G70","v":0},null,"Total",{"$f":"IF(SUM(G62:G69)=0,\"1\",SUM(G62:G69))","v":"1"},{"$f":"SUM(H62:H69)","v":0},{"$f":"SUM(I62:I69)","v":0},{"$f":"SUM(J62:J69)","v":0},{"$f":"SUM(K62:K69)","v":0},{"$f":"SUM(L62:L69)","v":0},null,{"$f":"SUM(H72:L72)","v":0},{"$f":"IF(G70<80,\"0,00\",IF(P71>0,\"0\",IF(G70>100,\"0,00\",IF(N62>=80,M62,IF(N62<80,0)))))","v":"0,00"},{"$f":"P62+P63+P64+P65+P66+P67+P68+P69","v":0},{"$f":"1","v":1},{"$f":"1","v":1}]
[null,null,null,null,null,null,"Percentage",{"$f":"IF(H71+G71=0,\"0\",(H71/G71)*100)","v":0},{"$f":"IF(I71+G71=0,\"0\",(I71/G71)*100)","v":0},{"$f":"IF(J71+G71=0,\"0\",(J71/G71)*100)","v":0},{"$f":"IF(K71+G71=0,\"0\",(K71/G71)*100)","v":0},{"$f":"IF(L71+G71=0,\"0\",(L71/G71)*100)","v":0},null,100,null,null,{"$f":"1","v":1},{"$f":"1","v":1}]
[null,null,null,null,null,{"$f":"IF(U60=1,((G71/100)*80))","v":false},"% of 80",{"$f":"(H72/80)*100","v":0},{"$f":"(I72/80)*100","v":0},{"$f":"(J72/80)*100","v":0},{"$f":"(K72/80)*100","v":0},{"$f":"(L72/80)*100","v":0},null,null,null,null,{"$f":"1","v":1},{"$f":"1","v":1}]
[null,null,null,null,null,null,"Limiter",{"$f":"IF(H73>100,\"100\",H73)","v":0},{"$f":"IF(I73>100,\"100\",I73)","v":0},{"$f":"IF(J73>100,\"100\",J73)","v":0},{"$f":"IF(K73>100,\"100\",K73)","v":0},{"$f":"IF(L73>100,\"100\",L73)","v":0},null,null,null,null,{"$f":"1","v":1},{"$f":"1","v":1}]
[null,null,null,null,null,null,null,null,{"$f":"IF(H74+I74+J74+K74+L74=0,0,100-(H74))","v":0},{"$f":"IF(H74+I74+J74+K74+L74=0,0,100-(H74+I74))","v":0},{"$f":"IF(J74+I74+H74+K74+L74=0,0,100-(J74+I74+H74))","v":0},{"$f":"IF(K74+J74+I74+H74+L74=0,0,100-(H74+I74+K74+J74))","v":0},null,null,null,null,{"$f":"1","v":1},{"$f":"1","v":1}]
[null,null,null,null,null,null,null,null,{"$f":"IF(I74>I75,I75,I74)","v":0},{"$f":"IF(J74>J75,J75,J74)","v":0},{"$f":"IF(K74>K75,K75,K74)","v":0},{"$f":"IF(L74>L75,L75,L74)","v":0},null,null,null,null,{"$f":"1","v":1},{"$f":"1","v":1}]
[null,null,null,null,null,null,null,null,null,null,null,{"$f":"IF(K76+J74+H74+I74>=100,0,L76)","v":0},null,null,null,null,{"$f":"1","v":1},{"$f":"1","v":1}]
[null,null,null,null,null,null,"Scores",{"$f":"IF(H71=0,0,0.01*(H74*H79))","v":0},{"$f":"IF(I71=0,0,0.01*(I76*I79))","v":0},{"$f":"IF(J71=0,0,0.01*(J76*J79))","v":0},{"$f":"IF(K71=0,0,0.01*(K76*K79))","v":0},{"$f":"IF(L71=0,0,0.01*(L77*L79))","v":0},null,null,null,null,{"$f":"1","v":1},{"$f":"1","v":1}]
[null,null,null,null,null,null,null,3,2.5,2,1.5,1,"Total",null,null,null,{"$f":"1","v":1},{"$f":"1","v":1}]
[null,null,"BÆREKONSTRUKSJON (4)",null,null,"Velg datatype:",null,null,null,null,null,null,null,null,null,null,{"$f":"IF(freq1>=6,0,1)","v":1},{"$f":"1","v":1},null,null,{"$f":"IF(G80=\"\",2,IF(ISERROR(VLOOKUP(G80,$T$1246:$U$1247,2,FALSE)),\"\",VLOOKUP(G80,$T$1246:$U$1247,2,FALSE)))","v":2}]
[null,null,null,{"$f":"IF(AND(P91>=1,type1=1),\"NB! Volum av nivåene kan ikke være større enn det totale volumet for hvert enkelt materiale!\",+IF(AND(P91>=1,type1=2),\"NB! Prosentandel for hvert nivå må registreres i prosent av det vurderte bygningselementet, og den totale prosentandelen kan ikke være større enn den totale prosent av hvert enkelt materiale!\",\"\"))","v":""},null,null,null,null,null,null,null,null,null,null,null,null,1,{"$f":"1","v":1}]
[null,null,{"$f":"IF(G80=\"\",\"\",IF(SUM(G82:G89)=0,\"\",IF(U80=1,IF(U80+L90=1,\"REGISTRER DET TOTALE VOLUMET AV RELEVANTE MATERIALER\",IF((U80+G90+L90)=1,\"REGISTRER DET TOTALE VOLUMET AV RELEVANTE MATERIALER\",IF(ISERROR(C91),\"REGISTRER DET TOTALE VOLUMET AV RELEVANTE MATERIALER\",IF(OR(G82>L90,G83>L90,G84>L90,G85>L90,G86>L90,G87>L90,G88>L90,G89>L90),\"Volumet av de enkelte materialer kan ikke overstige mengden relevante materialer\",IF(SUM(G82:G89)>L90,\"Den totale mengden av materialer kan ikke overstige det  totale volumet av relevante materialer\",\"\"))))),IF(U80=2,IF(SUM(G82:G89)<80,\"Minst 80 % av de relevante materialer må vurderes, vennligst beregn på nytt.\",IF(OR(G82>100,G83>100,G84>100,G85>100,G86>100,G87>100,G88>100,G89>100),\"Prosentandel av de enkelte materialerer kan ikke overstige 100\",IF(SUM(G82:G89)>100,\"Den totale prosentandelen av materialer kan ikke overstige 100\",\"\")))))))","v":""},null,"Mat. 1",null,null,null,null,null,null,null,{"$f":"IF(SUM(H98+I98+J98+K98+L98)>=3,\"3,00\",SUM(H98+I98+J98+K98+L98))","v":0},{"$f":"IF(AND(U80=1,L90=\"\"),0,IF(OR(NOT(D81=\"\"),NOT(C82=\"\"),NOT(N83=\"\")),0,IF(ISERROR(N91),\"0\",N91)))","v":0},null,{"$f":"IF(SUM(H82:L82)>G82,\"1\",\"0\")","v":"0"},1,{"$f":"1","v":1}]
[null,null,null,null,"Mat. 2",null,null,null,null,null,null,null,null,{"$f":"IF(AND(U80=1,L90=\"\"),C82,+IF(G91>L90,C82,(IF(N91<80,\"Ingen poeng oppnådd,\nmindre enn 80 % oppfyller kravet\",\"\"))))","v":""},null,{"$f":"IF(SUM(H83:L83)>G83,\"1\",\"0\")","v":"0"},1,{"$f":"1","v":1}]
[null,null,null,null,"Mat. 3",null,null,null,null,null,null,null,null,null,null,"0",1,{"$f":"1","v":1}]
[null,null,null,null,"Mat. 4",null,null,null,null,null,null,null,null,null,null,"0",1,{"$f":"1","v":1}]
[null,null,null,null,"Mat. 5",null,null,null,null,null,null,null,null,null,null,"0",1,{"$f":"1","v":1}]
[null,null,null,null,"Mat. 6",null,null,null,null,null,null,null,null,null,null,"0",1,{"$f":"1","v":1}]
[null,null,null,null,"Mat. 7",null,null,null,null,null,null,null,null,null,null,"0",1,{"$f":"1","v":1}]
[null,null,null,null,"Mat. 8",null,null,null,null,null,null,null,null,null,null,"0",1,{"$f":"1","v":1}]
[null,null,null,null,"Totalt % av bygningselementet (relevante materialer) vurdert:",null,{"$f":"IF(U80=\"\",0,IF(U80+L90=1,0,IF(SUM(G82:G89)=0,0,IF(U80=1,IF(OR(G82>L90,G83>L90,G84>L90,G85>L90,G86>L90,G87>L90,G88>L90,G89>L90,SUM(G82:G89)>L90),0,((SUM(G82:G89)/L90)*100)),IF(U80=2,IF(OR(G82>100,G83>100,G84>100,G85>100,G86>100,G87>100,G88>100,G89>100,SUM(G82:G89)>100),0,SUM(G82:G89)))))))","v":0},"Samlet volum for aktuelle elementer:",null,null,null,null,null,null,null,null,1,{"$f":"1","v":1}]
[null,null,{"$f":"IF(G90=0,\"0\",IF(U80=2,\"0\",IF(U80=1,(G90/100)*100,IF(U80=2,(G90/100)*100))))","v":"0"},{"$f":"G90","v":0},null,"Total",{"$f":"IF(SUM(G82:G89)=0,\"1\",SUM(G82:G89))","v":"1"},{"$f":"SUM(H82:H89)","v":0},{"$f":"SUM(I82:I89)","v":0},{"$f":"SUM(J82:J89)","v":0},{"$f":"SUM(K82:K89)","v":0},{"$f":"SUM(L82:L89)","v":0},null,{"$f":"SUM(H92:L92)","v":0},{"$f":"IF(G90<80,\"0,00\",IF(P91>0,\"0\",IF(G90>100,\"0,00\",IF(N82>=80,M82,IF(N82<80,0)))))","v":"0,00"},{"$f":"P82+P83+P84+P85+P86+P87+P88+P89","v":0},{"$f":"1","v":1},{"$f":"1","v":1}]
[null,null,null,null,null,null,"Percentage",{"$f":"IF(H91+G91=0,\"0\",(H91/G91)*100)","v":0},{"$f":"IF(I91+G91=0,\"0\",(I91/G91)*100)","v":0},{"$f":"IF(J91+G91=0,\"0\",(J91/G91)*100)","v":0},{"$f":"IF(K91+G91=0,\"0\",(K91/G91)*100)","v":0},{"$f":"IF(L91+G91=0,\"0\",(L91/G91)*100)","v":0},null,100,null,null,{"$f":"1","v":1},{"$f":"1","v":1}]
[null,null,null,null,null,{"$f":"IF(U80=1,((G91/100)*80))","v":false},"% of 80",{"$f":"(H92/80)*100","v":0},{"$f":"(I92/80)*100","v":0},{"$f":"(J92/80)*100","v":0},{"$f":"(K92/80)*100","v":0},{"$f":"(L92/80)*100","v":0},null,null,null,null,{"$f":"1","v":1},{"$f":"1","v":1}]
[null,null,null,null,null,null,"Limiter",{"$f":"IF(H93>100,\"100\",H93)","v":0},{"$f":"IF(I93>100,\"100\",I93)","v":0},{"$f":"IF(J93>100,\"100\",J93)","v":0},{"$f":"IF(K93>100,\"100\",K93)","v":0},{"$f":"IF(L93>100,\"100\",L93)","v":0},null,null,null,null,{"$f":"1","v":1},{"$f":"1","v":1}]
[null,null,null,null,null,null,null,null,{"$f":"IF(H94+I94+J94+K94+L94=0,0,100-(H94))","v":0},{"$f":"IF(H94+I94+J94+K94+L94=0,0,100-(H94+I94))","v":0},{"$f":"IF(J94+I94+H94+K94+L94=0,0,100-(J94+I94+H94))","v":0},{"$f":"IF(K94+J94+I94+H94+L94=0,0,100-(H94+I94+K94+J94))","v":0},null,null,null,null,{"$f":"1","v":1},{"$f":"1","v":1}]
[null,null,null,null,null,null,null,null,{"$f":"IF(I94>I95,I95,I94)","v":0},{"$f":"IF(J94>J95,J95,J94)","v":0},{"$f":"IF(K94>K95,K95,K94)","v":0},{"$f":"IF(L94>L95,L95,L94)","v":0},null,null,null,null,{"$f":"1","v":1},{"$f":"1","v":1}]
[null,null,null,null,null,null,null,null,null,null,null,{"$f":"IF(K96+J94+H94+I94>=100,0,L96)","v":0},null,null,null,null,{"$f":"1","v":1},{"$f":"1","v":1}]
[null,null,null,null,null,null,"Scores",{"$f":"IF(H91=0,0,0.01*(H94*H99))","v":0},{"$f":"IF(I91=0,0,0.01*(I96*I99))","v":0},{"$f":"IF(J91=0,0,0.01*(J96*J99))","v":0},{"$f":"IF(K91=0,0,0.01*(K96*K99))","v":0},{"$f":"IF(L91=0,0,0.01*(L97*L99))","v":0},null,null,null,null,{"$f":"1","v":1},{"$f":"1","v":1}]
[null,null,null,null,null,null,null,3,2.5,2,1.5,1,"Total",null,null,null,{"$f":"1","v":1},{"$f":"1","v":1}]
[null,null,"GULV PÅ GRUNN",null,null,"Velg antall gulv på grunn du ønsker å vurdere (deretter trykk «velg»):",null,null,null,null,{"$f":"IF(AND(G100=\"\",G111>0),\"NB! Husk å velge antall elementer...\",\"\")","v":""},null,null,null,{"$f":"IF(ISERROR(O112+O132+O152+O172)/V101,\"\",(O112+O132+O152+O172)/V101)","v":0},null,{"$f":"0","v":0},{"$f":"IF(asstype=2,0,1)","v":1},null,{"$f":"VLOOKUP(G100,$T$1239:$U$1243,2,FALSE)","v":2}]
[null,null,{"$f":"IF(G100=\"\",\"GULV PÅ GRUNN\",\"GULV PÅ GRUNN (1)\")","v":"GULV PÅ GRUNN"},null,null,"Velg datatype:","Prosentandel",null,null,null,null,null,null,null,null,null,{"$f":"IF(freq2>=3,0,1)","v":1},{"$f":"IF(asstype=2,0,1)","v":1},null,null,{"$f":"IF(G101=\"\",2,IF(ISERROR(VLOOKUP(G101,$T$1246:$U$1247,2,FALSE)),\"\",VLOOKUP(G101,$T$1246:$U$1247,2,FALSE)))","v":2},{"$f":"IF(freq2=3,1,IF(freq2=4,2,IF(freq2=5,3,IF(freq2=6,4,1))))","v":1}]
[null,null,null,{"$f":"IF(AND(P112>=1,type1=1),\"NB! Volum av nivåene kan ikke være større enn det totale volumet for hvert enkelt materiale!\",+IF(AND(P112>=1,type1=2),\"NB! Prosentandel for hvert nivå må registreres i prosent av det vurderte bygningselementet, og den totale prosentandelen kan ikke være større enn den totale prosent av hvert enkelt materiale!\",\"\"))","v":""},null,null,null,null,null,null,null,null,null,null,null,null,{"$f":"IF(freq2>=3,0,1)","v":1},1]
[null,null,{"$f":"IF(G101=\"\",\"\",IF(SUM(G103:G110)=0,\"\",IF(U101=1,IF(U101+L111=1,\"REGISTRER DET TOTALE VOLUMET AV RELEVANTE MATERIALER\",IF((U101+G111+L111)=1,\"REGISTRER DET TOTALE VOLUMET AV RELEVANTE MATERIALER\",IF(ISERROR(C112),\"REGISTRER DET TOTALE VOLUMET AV RELEVANTE MATERIALER\",IF(OR(G103>L111,G104>L111,G105>L111,G106>L111,G107>L111,G108>L111,G109>L111,G110>L111),\"Volumet av de enkelte materialer kan ikke overstige mengden relevante materialer\",IF(SUM(G103:G110)>L111,\"Den totale mengden av materialer kan ikke overstige det  totale volumet av relevante materialer\",\"\"))))),IF(U101=2,IF(SUM(G103:G110)<80,\"Minst 80 % av de relevante materialer må vurderes, vennligst beregn på nytt.\",IF(OR(G103>100,G104>100,G105>100,G106>100,G107>100,G108>100,G109>100,G110>100),\"Prosentandel av de enkelte materialerer kan ikke overstige 100\",IF(SUM(G103:G110)>100,\"Den totale prosentandelen av materialer kan ikke overstige 100\",\"\")))))))","v":""},null,"Mat. 1",null,null,null,null,null,null,null,{"$f":"IF(SUM(H119+I119+J119+K119+L119)>=3,\"3,00\",SUM(H119+I119+J119+K119+L119))","v":0},{"$f":"IF(AND(U104=1,L111=\"\"),0,IF(OR(NOT(D102=\"\"),NOT(C103=\"\"),NOT(N104=\"\")),0,IF(ISERROR(N112),\"0\",N112)))","v":0},null,{"$f":"IF(SUM(H103:L103)>G103,\"1\",\"0\")","v":"0"},{"$f":"IF(freq2>=3,0,1)","v":1},1]
[null,null,null,null,"Mat. 2",null,null,null,null,null,null,null,null,{"$f":"IF(AND(U101=1,L111=\"\"),C103,+IF(G112>L111,C103,(IF(N112<80,\"Ingen poeng oppnådd,\nmindre enn 80 % oppfyller kravet\",\"\"))))","v":""},null,{"$f":"IF(SUM(H104:L104)>G104,\"1\",\"0\")","v":"0"},{"$f":"IF(freq2>=3,0,1)","v":1},1]
[null,null,null,null,"Mat. 3",null,null,null,null,null,null,null,null,null,null,"0",{"$f":"IF(freq2>=3,0,1)","v":1},1]
[null,null,null,null,"Mat. 4",null,null,null,null,null,null,null,null,null,null,"0",1,1]
[null,null,null,null,"Mat. 5",null,null,null,null,null,null,null,null,null,null,"0",1,1]
[null,null,null,null,"Mat. 6",null,null,null,null,null,null,null,null,null,null,"0",1,1]
[null,null,null,null,"Mat. 7",null,null,null,null,null,null,null,null,null,null,"0",1,1]
[null,null,null,null,"Mat. 8",null,null,null,null,null,null,null,null,null,null,"0",1,1]
[null,null,null,null,"Totalt % av bygningselementet (relevante materialer) vurdert:",null,{"$f":"IF(U101=\"\",0,IF(U101+L111=1,0,IF(SUM(G103:G110)=0,0,IF(U101=1,IF(OR(G103>L111,G104>L111,G105>L111,G106>L111,G107>L111,G108>L111,G109>L111,G110>L111,SUM(G103:G110)>L111),0,((SUM(G103:G110)/L111)*100)),IF(U101=2,IF(OR(G103>100,G104>100,G105>100,G106>100,G107>100,G108>100,G109>100,G110>100,SUM(G103:G110)>100),0,SUM(G103:G110)))))))","v":0},"Samlet volum for aktuelle elementer:",null,null,null,null,null,null,null,null,1,1]
[null,null,{"$f":"IF(G111=0,\"0\",IF(U104=2,\"0\",IF(U104=1,(G111/100)*100,IF(U104=2,(G111/100)*100))))","v":"0"},{"$f":"G111","v":0},null,"Total",{"$f":"IF(SUM(G103:G110)=0,\"1\",SUM(G103:G110))","v":"1"},{"$f":"SUM(H103:H110)","v":0},{"$f":"SUM(I103:I110)","v":0},{"$f":"SUM(J103:J110)","v":0},{"$f":"SUM(K103:K110)","v":0},{"$f":"SUM(L103:L110)","v":0},null,{"$f":"SUM(H113:L113)","v":0},{"$f":"IF(G111<80,\"0,00\",IF(P112>0,\"0\",IF(G111>100,\"0,00\",IF(N103>=80,M103,IF(N103<80,0)))))","v":"0,00"},{"$f":"P103+P104+P105+P106+P107+P108+P109+P110","v":0},{"$f":"1","v":1},{"$f":"1","v":1}]
[null,null,null,null,null,null,"Percentage",{"$f":"IF(H112+G112=0,\"0\",(H112/G112)*100)","v":0},{"$f":"IF(I112+G112=0,\"0\",(I112/G112)*100)","v":0},{"$f":"IF(J112+G112=0,\"0\",(J112/G112)*100)","v":0},{"$f":"IF(K112+G112=0,\"0\",(K112/G112)*100)","v":0},{"$f":"IF(L112+G112=0,\"0\",(L112/G112)*100)","v":0},null,100,null,null,{"$f":"1","v":1},{"$f":"1","v":1}]
[null,null,null,null,null,{"$f":"IF(U104=1,((G112/100)*80))","v":false},"% of 80",{"$f":"(H113/80)*100","v":0},{"$f":"(I113/80)*100","v":0},{"$f":"(J113/80)*100","v":0},{"$f":"(K113/80)*100","v":0},{"$f":"(L113/80)*100","v":0},null,null,null,null,{"$f":"1","v":1},{"$f":"1","v":1}]
[null,null,null,null,null,null,"Limiter",{"$f":"IF(H114>100,\"100\",H114)","v":0},{"$f":"IF(I114>100,\"100\",I114)","v":0},{"$f":"IF(J114>100,\"100\",J114)","v":0},{"$f":"IF(K114>100,\"100\",K114)","v":0},{"$f":"IF(L114>100,\"100\",L114)","v":0},null,null,null,null,{"$f":"1","v":1},{"$f":"1","v":1}]
[null,null,null,null,null,null,null,null,{"$f":"IF(H115+I115+J115+K115+L115=0,0,100-(H115))","v":0},{"$f":"IF(H115+I115+J115+K115+L115=0,0,100-(H115+I115))","v":0},{"$f":"IF(J115+I115+H115+K115+L115=0,0,100-(J115+I115+H115))","v":0},{"$f":"IF(K115+J115+I115+H115+L115=0,0,100-(H115+I115+K115+J115))","v":0},null,null,null,null,{"$f":"1","v":1},{"$f":"1","v":1}]
[null,null,null,null,null,null,null,null,{"$f":"IF(I115>I116,I116,I115)","v":0},{"$f":"IF(J115>J116,J116,J115)","v":0},{"$f":"IF(K115>K116,K116,K115)","v":0},{"$f":"IF(L115>L116,L116,L115)","v":0},null,null,null,null,{"$f":"1","v":1},{"$f":"1","v":1}]
[null,null,null,null,null,null,null,null,null,null,null,{"$f":"IF(K117+J115+H115+I115>=100,0,L117)","v":0},null,null,null,null,{"$f":"1","v":1},{"$f":"1","v":1}]
[null,null,null,null,null,null,"Scores",{"$f":"IF(H112=0,0,0.01*(H115*H120))","v":0},{"$f":"IF(I112=0,0,0.01*(I117*I120))","v":0},{"$f":"IF(J112=0,0,0.01*(J117*J120))","v":0},{"$f":"IF(K112=0,0,0.01*(K117*K120))","v":0},{"$f":"IF(L112=0,0,0.01*(L118*L120))","v":0},null,null,null,null,{"$f":"1","v":1},{"$f":"1","v":1}]
[null,null,null,null,null,null,null,3,2.5,2,1.5,1,"Total",null,null,null,{"$f":"1","v":1},{"$f":"1","v":1}]
[null,null,"GULV PÅ GRUNN (2)",null,null,"Velg datatype:",null,null,null,null,null,null,null,null,null,null,{"$f":"IF(freq2>=4,0,1)","v":1},{"$f":"1","v":1},null,null,{"$f":"IF(G121=\"\",2,IF(ISERROR(VLOOKUP(G121,$T$1246:$U$1247,2,FALSE)),\"\",VLOOKUP(G121,$T$1246:$U$1247,2,FALSE)))","v":2}]
[null,null,null,{"$f":"IF(AND(P132>=1,type1=1),\"NB! Volum av nivåene kan ikke være større enn det totale volumet for hvert enkelt materiale!\",+IF(AND(P132>=1,type1=2),\"NB! Prosentandel for hvert nivå må registreres i prosent av det vurderte bygningselementet, og den totale prosentandelen kan ikke være større enn den totale prosent av hvert enkelt materiale!\",\"\"))","v":""},null,null,null,null,null,null,null,null,null,null,null,null,1,{"$f":"1","v":1}]
[null,null,{"$f":"IF(G121=\"\",\"\",IF(SUM(G123:G130)=0,\"\",IF(U121=1,IF(U121+L131=1,\"REGISTRER DET TOTALE VOLUMET AV RELEVANTE MATERIALER\",IF((U121+G131+L131)=1,\"REGISTRER DET TOTALE VOLUMET AV RELEVANTE MATERIALER\",IF(ISERROR(C132),\"REGISTRER DET TOTALE VOLUMET AV RELEVANTE MATERIALER\",IF(OR(G123>L131,G124>L131,G125>L131,G126>L131,G127>L131,G128>L131,G129>L131,G130>L131),\"Volumet av de enkelte materialer kan ikke overstige mengden relevante materialer\",IF(SUM(G123:G130)>L131,\"Den totale mengden av materialer kan ikke overstige det  totale volumet av relevante materialer\",\"\"))))),IF(U121=2,IF(SUM(G123:G130)<80,\"Minst 80 % av de relevante materialer må vurderes, vennligst beregn på nytt.\",IF(OR(G123>100,G124>100,G125>100,G126>100,G127>100,G128>100,G129>100,G130>100),\"Prosentandel av de enkelte materialerer kan ikke overstige 100\",IF(SUM(G123:G130)>100,\"Den totale prosentandelen av materialer kan ikke overstige 100\",\"\")))))))","v":""},null,"Mat. 1",null,null,null,null,null,null,null,{"$f":"IF(SUM(H139+I139+J139+K139+L139)>=3,\"3,00\",SUM(H139+I139+J139+K139+L139))","v":0},{"$f":"IF(AND(U121=1,L131=\"\"),0,IF(OR(NOT(D122=\"\"),NOT(C123=\"\"),NOT(N124=\"\")),0,IF(ISERROR(N132),\"0\",N132)))","v":0},null,{"$f":"IF(SUM(H123:L123)>G123,\"1\",\"0\")","v":"0"},1,{"$f":"1","v":1}]
[null,null,null,null,"Mat. 2",null,null,null,null,null,null,null,null,{"$f":"IF(AND(U121=1,L131=\"\"),C123,+IF(G132>L131,C123,(IF(N132<80,\"Ingen poeng oppnådd,\nmindre enn 80 % oppfyller kravet\",\"\"))))","v":""},null,{"$f":"IF(SUM(H124:L124)>G124,\"1\",\"0\")","v":"0"},1,{"$f":"1","v":1}]
[null,null,null,null,"Mat. 3",null,null,null,null,null,null,null,null,null,null,"0",1,{"$f":"1","v":1}]
[null,null,null,null,"Mat. 4",null,null,null,null,null,null,null,null,null,null,"0",1,{"$f":"1","v":1}]
[null,null,null,null,"Mat. 5",null,null,null,null,null,null,null,null,null,null,"0",{"$f":"IF(freq2>=4,0,1)","v":1},{"$f":"1","v":1}]
[null,null,null,null,"Mat. 6",null,null,null,null,null,null,null,null,null,null,"0",{"$f":"IF(freq2>=4,0,1)","v":1},{"$f":"1","v":1}]
[null,null,null,null,"Mat. 7",null,null,null,null,null,null,null,null,null,null,"0",{"$f":"IF(freq2>=4,0,1)","v":1},{"$f":"1","v":1}]
[null,null,null,null,"Mat. 8",null,null,null,null,null,null,null,null,null,null,"0",{"$f":"IF(freq2>=4,0,1)","v":1},{"$f":"1","v":1}]
[null,null,null,null,"Totalt % av bygningselementet (relevante materialer) vurdert:",null,{"$f":"IF(U121=\"\",0,IF(U121+L131=1,0,IF(SUM(G123:G130)=0,0,IF(U121=1,IF(OR(G123>L131,G124>L131,G125>L131,G126>L131,G127>L131,G128>L131,G129>L131,G130>L131,SUM(G123:G130)>L131),0,((SUM(G123:G130)/L131)*100)),IF(U121=2,IF(OR(G123>100,G124>100,G125>100,G126>100,G127>100,G128>100,G129>100,G130>100,SUM(G123:G130)>100),0,SUM(G123:G130)))))))","v":0},"Samlet volum for aktuelle elementer:",null,null,null,null,null,null,null,null,{"$f":"IF(freq2>=4,0,1)","v":1},{"$f":"1","v":1}]
[null,null,{"$f":"IF(G131=0,\"0\",IF(U121=2,\"0\",IF(U121=1,(G131/100)*100,IF(U121=2,(G131/100)*100))))","v":"0"},{"$f":"G131","v":0},null,"Total",{"$f":"IF(SUM(G123:G130)=0,\"1\",SUM(G123:G130))","v":"1"},{"$f":"SUM(H123:H130)","v":0},{"$f":"SUM(I123:I130)","v":0},{"$f":"SUM(J123:J130)","v":0},{"$f":"SUM(K123:K130)","v":0},{"$f":"SUM(L123:L130)","v":0},null,{"$f":"SUM(H133:L133)","v":0},{"$f":"IF(G131<80,\"0,00\",IF(P132>0,\"0\",IF(G131>100,\"0,00\",IF(N123>=80,M123,IF(N123<80,0)))))","v":"0,00"},{"$f":"P123+P124+P125+P126+P127+P128+P129+P130","v":0},{"$f":"1","v":1},{"$f":"1","v":1}]
[null,null,null,null,null,null,"Percentage",{"$f":"IF(H132+G132=0,\"0\",(H132/G132)*100)","v":0},{"$f":"IF(I132+G132=0,\"0\",(I132/G132)*100)","v":0},{"$f":"IF(J132+G132=0,\"0\",(J132/G132)*100)","v":0},{"$f":"IF(K132+G132=0,\"0\",(K132/G132)*100)","v":0},{"$f":"IF(L132+G132=0,\"0\",(L132/G132)*100)","v":0},null,100,null,null,{"$f":"1","v":1},{"$f":"1","v":1}]
[null,null,null,null,null,{"$f":"IF(U121=1,((G132/100)*80))","v":false},"% of 80",{"$f":"(H133/80)*100","v":0},{"$f":"(I133/80)*100","v":0},{"$f":"(J133/80)*100","v":0},{"$f":"(K133/80)*100","v":0},{"$f":"(L133/80)*100","v":0},null,null,null,null,{"$f":"1","v":1},{"$f":"1","v":1}]
[null,null,null,null,null,null,"Limiter",{"$f":"IF(H134>100,\"100\",H134)","v":0},{"$f":"IF(I134>100,\"100\",I134)","v":0},{"$f":"IF(J134>100,\"100\",J134)","v":0},{"$f":"IF(K134>100,\"100\",K134)","v":0},{"$f":"IF(L134>100,\"100\",L134)","v":0},null,null,null,null,{"$f":"1","v":1},{"$f":"1","v":1}]
[null,null,null,null,null,null,null,null,{"$f":"IF(H135+I135+J135+K135+L135=0,0,100-(H135))","v":0},{"$f":"IF(H135+I135+J135+K135+L135=0,0,100-(H135+I135))","v":0},{"$f":"IF(J135+I135+H135+K135+L135=0,0,100-(J135+I135+H135))","v":0},{"$f":"IF(K135+J135+I135+H135+L135=0,0,100-(H135+I135+K135+J135))","v":0},null,null,null,null,{"$f":"1","v":1},{"$f":"1","v":1}]
[null,null,null,null,null,null,null,null,{"$f":"IF(I135>I136,I136,I135)","v":0},{"$f":"IF(J135>J136,J136,J135)","v":0},{"$f":"IF(K135>K136,K136,K135)","v":0},{"$f":"IF(L135>L136,L136,L135)","v":0},null,null,null,null,{"$f":"1","v":1},{"$f":"1","v":1}]
[null,null,null,null,null,null,null,null,null,null,null,{"$f":"IF(K137+J135+H135+I135>=100,0,L137)","v":0},null,null,null,null,{"$f":"1","v":1},{"$f":"1","v":1}]
[null,null,null,null,null,null,"Scores",{"$f":"IF(H132=0,0,0.01*(H135*H140))","v":0},{"$f":"IF(I132=0,0,0.01*(I137*I140))","v":0},{"$f":"IF(J132=0,0,0.01*(J137*J140))","v":0},{"$f":"IF(K132=0,0,0.01*(K137*K140))","v":0},{"$f":"IF(L132=0,0,0.01*(L138*L140))","v":0},null,null,null,null,{"$f":"1","v":1},{"$f":"1","v":1}]
[null,null,null,null,null,null,null,3,2.5,2,1.5,1,"Total",null,null,null,{"$f":"1","v":1},{"$f":"1","v":1}]
[null,null,"GULV PÅ GRUNN (3)",null,null,"Velg datatype:",null,null,null,null,null,null,null,null,null,null,{"$f":"IF(freq2>=5,0,1)","v":1},{"$f":"1","v":1},null,null,{"$f":"IF(G141=\"\",2,IF(ISERROR(VLOOKUP(G141,$T$1246:$U$1247,2,FALSE)),\"\",VLOOKUP(G141,$T$1246:$U$1247,2,FALSE)))","v":2}]
[null,null,null,{"$f":"IF(AND(P152>=1,type1=1),\"NB! Volum av nivåene kan ikke være større enn det totale volumet for hvert enkelt materiale!\",+IF(AND(P152>=1,type1=2),\"NB! Prosentandel for hvert nivå må registreres i prosent av det vurderte bygningselementet, og den totale prosentandelen kan ikke være større enn den totale prosent av hvert enkelt materiale!\",\"\"))","v":""},null,null,null,null,null,null,null,null,null,null,null,null,1,{"$f":"1","v":1}]
[null,null,{"$f":"IF(G141=\"\",\"\",IF(SUM(G143:G150)=0,\"\",IF(U141=1,IF(U141+L151=1,\"REGISTRER DET TOTALE VOLUMET AV RELEVANTE MATERIALER\",IF((U141+G151+L151)=1,\"REGISTRER DET TOTALE VOLUMET AV RELEVANTE MATERIALER\",IF(ISERROR(C152),\"REGISTRER DET TOTALE VOLUMET AV RELEVANTE MATERIALER\",IF(OR(G143>L151,G144>L151,G145>L151,G146>L151,G147>L151,G148>L151,G149>L151,G150>L151),\"Volumet av de enkelte materialer kan ikke overstige mengden relevante materialer\",IF(SUM(G143:G150)>L151,\"Den totale mengden av materialer kan ikke overstige det  totale volumet av relevante materialer\",\"\"))))),IF(U141=2,IF(SUM(G143:G150)<80,\"Minst 80 % av de relevante materialer må vurderes, vennligst beregn på nytt.\",IF(OR(G143>100,G144>100,G145>100,G146>100,G147>100,G148>100,G149>100,G150>100),\"Prosentandel av de enkelte materialerer kan ikke overstige 100\",IF(SUM(G143:G150)>100,\"Den totale prosentandelen av materialer kan ikke overstige 100\",\"\")))))))","v":""},null,"Mat. 1",null,null,null,null,null,null,null,{"$f":"IF(SUM(H159+I159+J159+K159+L159)>=3,\"3,00\",SUM(H159+I159+J159+K159+L159))","v":0},{"$f":"IF(AND(U141=1,L151=\"\"),0,IF(OR(NOT(D142=\"\"),NOT(C143=\"\"),NOT(N144=\"\")),0,IF(ISERROR(N152),\"0\",N152)))","v":0},null,{"$f":"IF(SUM(H143:L143)>G143,\"1\",\"0\")","v":"0"},1,{"$f":"1","v":1}]
[null,null,null,null,"Mat. 2",null,null,null,null,null,null,null,null,{"$f":"IF(AND(U141=1,L151=\"\"),C143,+IF(G152>L151,C143,(IF(N152<80,\"Ingen poeng oppnådd,\nmindre enn 80 % oppfyller kravet\",\"\"))))","v":""},null,{"$f":"IF(SUM(H144:L144)>G144,\"1\",\"0\")","v":"0"},1,{"$f":"1","v":1}]
[null,null,null,null,"Mat. 3",null,null,null,null,null,null,null,null,null,null,"0",1,{"$f":"1","v":1}]
[null,null,null,null,"Mat. 4",null,null,null,null,null,null,null,null,null,null,"0",1,{"$f":"1","v":1}]
[null,null,null,null,"Mat. 5",null,null,null,null,null,null,null,null,null,null,"0",1,{"$f":"1","v":1}]
[null,null,null,null,"Mat. 6",null,null,null,null,null,null,null,null,null,null,"0",1,{"$f":"1","v":1}]
[null,null,null,null,"Mat. 7",null,null,null,null,null,null,null,null,null,null,"0",{"$f":"IF(freq2>=5,0,1)","v":1},{"$f":"1","v":1}]
[null,null,null,null,"Mat. 8",null,null,null,null,null,null,null,null,null,null,"0",{"$f":"IF(freq2>=5,0,1)","v":1},{"$f":"1","v":1}]
[null,null,null,null,"Totalt % av bygningselementet (relevante materialer) vurdert:",null,{"$f":"IF(U141=\"\",0,IF(U141+L151=1,0,IF(SUM(G143:G150)=0,0,IF(U141=1,IF(OR(G143>L151,G144>L151,G145>L151,G146>L151,G147>L151,G148>L151,G149>L151,G150>L151,SUM(G143:G150)>L151),0,((SUM(G143:G150)/L151)*100)),IF(U141=2,IF(OR(G143>100,G144>100,G145>100,G146>100,G147>100,G148>100,G149>100,G150>100,SUM(G143:G150)>100),0,SUM(G143:G150)))))))","v":0},"Samlet volum for aktuelle elementer:",null,null,null,null,null,null,null,null,{"$f":"IF(freq2>=5,0,1)","v":1},{"$f":"1","v":1}]
[null,null,{"$f":"IF(G151=0,\"0\",IF(U141=2,\"0\",IF(U141=1,(G151/100)*100,IF(U141=2,(G151/100)*100))))","v":"0"},{"$f":"G151","v":0},null,"Total",{"$f":"IF(SUM(G143:G150)=0,\"1\",SUM(G143:G150))","v":"1"},{"$f":"SUM(H143:H150)","v":0},{"$f":"SUM(I143:I150)","v":0},{"$f":"SUM(J143:J150)","v":0},{"$f":"SUM(K143:K150)","v":0},{"$f":"SUM(L143:L150)","v":0},null,{"$f":"SUM(H153:L153)","v":0},{"$f":"IF(G151<80,\"0,00\",IF(P152>0,\"0\",IF(G151>100,\"0,00\",IF(N143>=80,M143,IF(N143<80,0)))))","v":"0,00"},{"$f":"P143+P144+P145+P146+P147+P148+P149+P150","v":0},{"$f":"1","v":1},{"$f":"1","v":1}]
[null,null,null,null,null,null,"Percentage",{"$f":"IF(H152+G152=0,\"0\",(H152/G152)*100)","v":0},{"$f":"IF(I152+G152=0,\"0\",(I152/G152)*100)","v":0},{"$f":"IF(J152+G152=0,\"0\",(J152/G152)*100)","v":0},{"$f":"IF(K152+G152=0,\"0\",(K152/G152)*100)","v":0},{"$f":"IF(L152+G152=0,\"0\",(L152/G152)*100)","v":0},null,100,null,null,{"$f":"1","v":1},{"$f":"1","v":1}]
[null,null,null,null,null,{"$f":"IF(U141=1,((G152/100)*80))","v":false},"% of 80",{"$f":"(H153/80)*100","v":0},{"$f":"(I153/80)*100","v":0},{"$f":"(J153/80)*100","v":0},{"$f":"(K153/80)*100","v":0},{"$f":"(L153/80)*100","v":0},null,null,null,null,{"$f":"1","v":1},{"$f":"1","v":1}]
[null,null,null,null,null,null,"Limiter",{"$f":"IF(H154>100,\"100\",H154)","v":0},{"$f":"IF(I154>100,\"100\",I154)","v":0},{"$f":"IF(J154>100,\"100\",J154)","v":0},{"$f":"IF(K154>100,\"100\",K154)","v":0},{"$f":"IF(L154>100,\"100\",L154)","v":0},null,null,null,null,{"$f":"1","v":1},{"$f":"1","v":1}]
[null,null,null,null,null,null,null,null,{"$f":"IF(H155+I155+J155+K155+L155=0,0,100-(H155))","v":0},{"$f":"IF(H155+I155+J155+K155+L155=0,0,100-(H155+I155))","v":0},{"$f":"IF(J155+I155+H155+K155+L155=0,0,100-(J155+I155+H155))","v":0},{"$f":"IF(K155+J155+I155+H155+L155=0,0,100-(H155+I155+K155+J155))","v":0},null,null,null,null,{"$f":"1","v":1},{"$f":"1","v":1}]
[null,null,null,null,null,null,null,null,{"$f":"IF(I155>I156,I156,I155)","v":0},{"$f":"IF(J155>J156,J156,J155)","v":0},{"$f":"IF(K155>K156,K156,K155)","v":0},{"$f":"IF(L155>L156,L156,L155)","v":0},null,null,null,null,{"$f":"1","v":1},{"$f":"1","v":1}]
[null,null,null,null,null,null,null,null,null,null,null,{"$f":"IF(K157+J155+H155+I155>=100,0,L157)","v":0},null,null,null,null,{"$f":"1","v":1},{"$f":"1","v":1}]
[null,null,null,null,null,null,"Scores",{"$f":"IF(H152=0,0,0.01*(H155*H160))","v":0},{"$f":"IF(I152=0,0,0.01*(I157*I160))","v":0},{"$f":"IF(J152=0,0,0.01*(J157*J160))","v":0},{"$f":"IF(K152=0,0,0.01*(K157*K160))","v":0},{"$f":"IF(L152=0,0,0.01*(L158*L160))","v":0},null,null,null,null,{"$f":"1","v":1},{"$f":"1","v":1}]
[null,null,null,null,null,null,null,3,2.5,2,1.5,1,"Total",null,null,null,{"$f":"1","v":1},{"$f":"1","v":1}]
[null,null,"GULV PÅ GRUNN (4)",null,null,"Velg datatype:",null,null,null,null,null,null,null,null,null,null,{"$f":"IF(freq2>=6,0,1)","v":1},{"$f":"1","v":1},null,null,{"$f":"IF(G161=\"\",2,IF(ISERROR(VLOOKUP(G161,$T$1246:$U$1247,2,FALSE)),\"\",VLOOKUP(G161,$T$1246:$U$1247,2,FALSE)))","v":2}]
[null,null,null,{"$f":"IF(AND(P172>=1,type1=1),\"NB! Volum av nivåene kan ikke være større enn det totale volumet for hvert enkelt materiale!\",+IF(AND(P172>=1,type1=2),\"NB! Prosentandel for hvert nivå må registreres i prosent av det vurderte bygningselementet, og den totale prosentandelen kan ikke være større enn den totale prosent av hvert enkelt materiale!\",\"\"))","v":""},null,null,null,null,null,null,null,null,null,null,null,null,1,{"$f":"1","v":1}]
[null,null,{"$f":"IF(G161=\"\",\"\",IF(SUM(G163:G170)=0,\"\",IF(U161=1,IF(U161+L171=1,\"REGISTRER DET TOTALE VOLUMET AV RELEVANTE MATERIALER\",IF((U161+G171+L171)=1,\"REGISTRER DET TOTALE VOLUMET AV RELEVANTE MATERIALER\",IF(ISERROR(C172),\"REGISTRER DET TOTALE VOLUMET AV RELEVANTE MATERIALER\",IF(OR(G163>L171,G164>L171,G165>L171,G166>L171,G167>L171,G168>L171,G169>L171,G170>L171),\"Volumet av de enkelte materialer kan ikke overstige mengden relevante materialer\",IF(SUM(G163:G170)>L171,\"Den totale mengden av materialer kan ikke overstige det  totale volumet av relevante materialer\",\"\"))))),IF(U161=2,IF(SUM(G163:G170)<80,\"Minst 80 % av de relevante materialer må vurderes, vennligst beregn på nytt.\",IF(OR(G163>100,G164>100,G165>100,G166>100,G167>100,G168>100,G169>100,G170>100),\"Prosentandel av de enkelte materialerer kan ikke overstige 100\",IF(SUM(G163:G170)>100,\"Den totale prosentandelen av materialer kan ikke overstige 100\",\"\")))))))","v":""},null,"Mat. 1",null,null,null,null,null,null,null,{"$f":"IF(SUM(H179+I179+J179+K179+L179)>=3,\"3,00\",SUM(H179+I179+J179+K179+L179))","v":0},{"$f":"IF(AND(U161=1,L171=\"\"),0,IF(OR(NOT(D162=\"\"),NOT(C163=\"\"),NOT(N164=\"\")),0,IF(ISERROR(N172),\"0\",N172)))","v":0},null,{"$f":"IF(SUM(H163:L163)>G163,\"1\",\"0\")","v":"0"},1,{"$f":"1","v":1}]
[null,null,null,null,"Mat. 2",null,null,null,null,null,null,null,null,{"$f":"IF(AND(U161=1,L171=\"\"),C163,+IF(G172>L171,C163,(IF(N172<80,\"Ingen poeng oppnådd,\nmindre enn 80 % oppfyller kravet\",\"\"))))","v":""},null,{"$f":"IF(SUM(H164:L164)>G164,\"1\",\"0\")","v":"0"},1,{"$f":"1","v":1}]
[null,null,null,null,"Mat. 3",null,null,null,null,null,null,null,null,null,null,"0",1,{"$f":"1","v":1}]
[null,null,null,null,"Mat. 4",null,null,null,null,null,null,null,null,null,null,"0",1,{"$f":"1","v":1}]
[null,null,null,null,"Mat. 5",null,null,null,null,null,null,null,null,null,null,"0",1,{"$f":"1","v":1}]
[null,null,null,null,"Mat. 6",null,null,null,null,null,null,null,null,null,null,"0",1,{"$f":"1","v":1}]
[null,null,null,null,"Mat. 7",null,null,null,null,null,null,null,null,null,null,"0",1,{"$f":"1","v":1}]
[null,null,null,null,"Mat. 8",null,null,null,null,null,null,null,null,null,null,"0",1,{"$f":"1","v":1}]
[null,null,null,null,"Totalt % av bygningselementet (relevante materialer) vurdert:",null,{"$f":"IF(U161=\"\",0,IF(U161+L171=1,0,IF(SUM(G163:G170)=0,0,IF(U161=1,IF(OR(G163>L171,G164>L171,G165>L171,G166>L171,G167>L171,G168>L171,G169>L171,G170>L171,SUM(G163:G170)>L171),0,((SUM(G163:G170)/L171)*100)),IF(U161=2,IF(OR(G163>100,G164>100,G165>100,G166>100,G167>100,G168>100,G169>100,G170>100,SUM(G163:G170)>100),0,SUM(G163:G170)))))))","v":0},"Samlet volum for aktuelle elementer:",null,null,null,null,null,null,null,null,1,{"$f":"1","v":1}]
[null,null,{"$f":"IF(G171=0,\"0\",IF(U161=2,\"0\",IF(U161=1,(G171/100)*100,IF(U161=2,(G171/100)*100))))","v":"0"},{"$f":"G171","v":0},null,"Total",{"$f":"IF(SUM(G163:G170)=0,\"1\",SUM(G163:G170))","v":"1"},{"$f":"SUM(H163:H170)","v":0},{"$f":"SUM(I163:I170)","v":0},{"$f":"SUM(J163:J170)","v":0},{"$f":"SUM(K163:K170)","v":0},{"$f":"SUM(L163:L170)","v":0},null,{"$f":"SUM(H173:L173)","v":0},{"$f":"IF(G171<80,\"0,00\",IF(P172>0,\"0\",IF(G171>100,\"0,00\",IF(N163>=80,M163,IF(N163<80,0)))))","v":"0,00"},{"$f":"P163+P164+P165+P166+P167+P168+P169+P170","v":0},{"$f":"1","v":1},{"$f":"1","v":1}]
[null,null,null,null,null,null,"Percentage",{"$f":"IF(H172+G172=0,\"0\",(H172/G172)*100)","v":0},{"$f":"IF(I172+G172=0,\"0\",(I172/G172)*100)","v":0},{"$f":"IF(J172+G172=0,\"0\",(J172/G172)*100)","v":0},{"$f":"IF(K172+G172=0,\"0\",(K172/G172)*100)","v":0},{"$f":"IF(L172+G172=0,\"0\",(L172/G172)*100)","v":0},null,100,null,null,{"$f":"1","v":1},{"$f":"1","v":1}]
[null,null,null,null,null,{"$f":"IF(U161=1,((G172/100)*80))","v":false},"% of 80",{"$f":"(H173/80)*100","v":0},{"$f":"(I173/80)*100","v":0},{"$f":"(J173/80)*100","v":0},{"$f":"(K173/80)*100","v":0},{"$f":"(L173/80)*100","v":0},null,null,null,null,{"$f":"1","v":1},{"$f":"1","v":1}]
[null,null,null,null,null,null,"Limiter",{"$f":"IF(H174>100,\"100\",H174)","v":0},{"$f":"IF(I174>100,\"100\",I174)","v":0},{"$f":"IF(J174>100,\"100\",J174)","v":0},{"$f":"IF(K174>100,\"100\",K174)","v":0},{"$f":"IF(L174>100,\"100\",L174)","v":0},null,null,null,null,{"$f":"1","v":1},{"$f":"1","v":1}]
[null,null,null,null,null,null,null,null,{"$f":"IF(H175+I175+J175+K175+L175=0,0,100-(H175))","v":0},{"$f":"IF(H175+I175+J175+K175+L175=0,0,100-(H175+I175))","v":0},{"$f":"IF(J175+I175+H175+K175+L175=0,0,100-(J175+I175+H175))","v":0},{"$f":"IF(K175+J175+I175+H175+L175=0,0,100-(H175+I175+K175+J175))","v":0},null,null,null,null,{"$f":"1","v":1},{"$f":"1","v":1}]
[null,null,null,null,null,null,null,null,{"$f":"IF(I175>I176,I176,I175)","v":0},{"$f":"IF(J175>J176,J176,J175)","v":0},{"$f":"IF(K175>K176,K176,K175)","v":0},{"$f":"IF(L175>L176,L176,L175)","v":0},null,null,null,null,{"$f":"1","v":1},{"$f":"1","v":1}]
[null,null,null,null,null,null,null,null,null,null,null,{"$f":"IF(K177+J175+H175+I175>=100,0,L177)","v":0},null,null,null,null,{"$f":"1","v":1},{"$f":"1","v":1}]
[null,null,null,null,null,null,"Scores",{"$f":"IF(H172=0,0,0.01*(H175*H180))","v":0},{"$f":"IF(I172=0,0,0.01*(I177*I180))","v":0},{"$f":"IF(J172=0,0,0.01*(J177*J180))","v":0},{"$f":"IF(K172=0,0,0.01*(K177*K180))","v":0},{"$f":"IF(L172=0,0,0.01*(L178*L180))","v":0},null,null,null,null,{"$f":"1","v":1},{"$f":"1","v":1}]
[null,null,null,null,null,null,null,3,2.5,2,1.5,1,"Total",null,null,null,{"$f":"1","v":1},{"$f":"1","v":1}]
[null,null,"ETASJESKILLERE",null,null,"Velg antall etasjeskillere du ønsker å vurdere (deretter trykk «velg»):",null,null,null,null,{"$f":"IF(AND(G181=\"\",G192>0),\"NB! Husk å velge antall elementer...\",\"\")","v":""},null,null,null,{"$f":"IF(ISERROR(O193+O213+O233+O253)/V182,\"\",(O193+O213+O233+O253)/V182)","v":0},null,{"$f":"IF(freq3>=3,0,1)","v":1},{"$f":"IF(asstype=2,0,1)","v":1},null,{"$f":"VLOOKUP(G181,$T$1239:$U$1243,2,FALSE)","v":2}]
[null,null,{"$f":"IF(G181=\"\",\"ETASJESKILLERE\",\"ETASJESKILLERE (1)\")","v":"ETASJESKILLERE"},null,null,"Velg datatype:","Volum",null,null,null,null,null,null,null,null,null,1,1,null,null,{"$f":"IF(G182=\"\",2,IF(ISERROR(VLOOKUP(G182,$T$1246:$U$1247,2,FALSE)),\"\",VLOOKUP(G182,$T$1246:$U$1247,2,FALSE)))","v":1},{"$f":"IF(freq3=3,1,IF(freq3=4,2,IF(freq3=5,3,IF(freq3=6,4,1))))","v":1}]
[null,null,null,{"$f":"IF(AND(P193>=1,type1=1),\"NB! Volum av nivåene kan ikke være større enn det totale volumet for hvert enkelt materiale!\",+IF(AND(P193>=1,type1=2),\"NB! Prosentandel for hvert nivå må registreres i prosent av det vurderte bygningselementet, og den totale prosentandelen kan ikke være større enn den totale prosent av hvert enkelt materiale!\",\"\"))","v":""},null,null,null,null,null,null,null,null,null,null,null,null,1,1]
[null,null,{"$f":"IF(G182=\"\",\"\",IF(SUM(G184:G191)=0,\"\",IF(U182=1,IF(U182+L192=1,\"REGISTRER DET TOTALE VOLUMET AV RELEVANTE MATERIALER\",IF((U182+G192+L192)=1,\"REGISTRER DET TOTALE VOLUMET AV RELEVANTE MATERIALER\",IF(ISERROR(C193),\"REGISTRER DET TOTALE VOLUMET AV RELEVANTE MATERIALER\",IF(OR(G184>L192,G185>L192,G186>L192,G187>L192,G188>L192,G189>L192,G190>L192,G191>L192),\"Volumet av de enkelte materialer kan ikke overstige mengden relevante materialer\",IF(SUM(G184:G191)>L192,\"Den totale mengden av materialer kan ikke overstige det  totale volumet av relevante materialer\",\"\"))))),IF(U182=2,IF(SUM(G184:G191)<80,\"Minst 80 % av de relevante materialer må vurderes, vennligst beregn på nytt.\",IF(OR(G184>100,G185>100,G186>100,G187>100,G188>100,G189>100,G190>100,G191>100),\"Prosentandel av de enkelte materialerer kan ikke overstige 100\",IF(SUM(G184:G191)>100,\"Den totale prosentandelen av materialer kan ikke overstige 100\",\"\")))))))","v":""},null,"Mat. 1",null,null,null,null,null,null,null,{"$f":"IF(SUM(H200+I200+J200+K200+L200)>=3,\"3,00\",SUM(H200+I200+J200+K200+L200))","v":0},{"$f":"IF(AND(U182=1,L192=\"\"),0,IF(OR(NOT(D183=\"\"),NOT(C184=\"\"),NOT(N185=\"\")),0,IF(ISERROR(N193),\"0\",N193)))","v":0},null,{"$f":"IF(SUM(H184:L184)>G184,\"1\",\"0\")","v":"0"},1,1]
[null,null,null,null,"Mat. 2",null,null,null,null,null,null,null,null,{"$f":"IF(AND(U182=1,L192=\"\"),C184,+IF(G193>L192,C184,(IF(N193<80,\"Ingen poeng oppnådd,\nmindre enn 80 % oppfyller kravet\",\"\"))))","v":""},null,{"$f":"IF(SUM(H185:L185)>G185,\"1\",\"0\")","v":"0"},1,1]
[null,null,null,null,"Mat. 3",null,null,null,null,null,null,null,null,null,null,{"$f":"IF(SUM(H186:L186)>G186,\"1\",\"0\")","v":"0"},1,1]
[null,null,null,null,"Mat. 4",null,null,null,null,null,null,null,null,null,null,"0",1,1]
[null,null,null,null,"Mat. 5",null,null,null,null,null,null,null,null,null,null,"0",1,1]
[null,null,null,null,"Mat. 6",null,null,null,null,null,null,null,null,null,null,"0",1,1]
[null,null,null,null,"Mat. 7",null,null,null,null,null,null,null,null,null,null,"0",1,1]
[null,null,null,null,"Mat. 8",null,null,null,null,null,null,null,null,null,null,"0",1,1]
[null,null,null,null,"Totalt % av bygningselementet (relevante materialer) vurdert:",null,{"$f":"IF(U182=\"\",0,IF(U182+L192=1,0,IF(SUM(G184:G191)=0,0,IF(U182=1,IF(OR(G184>L192,G185>L192,G186>L192,G187>L192,G188>L192,G189>L192,G190>L192,G191>L192,SUM(G184:G191)>L192),0,((SUM(G184:G191)/L192)*100)),IF(U182=2,IF(OR(G184>100,G185>100,G186>100,G187>100,G188>100,G189>100,G190>100,G191>100,SUM(G184:G191)>100),0,SUM(G184:G191)))))))","v":0},"Samlet volum for aktuelle elementer:",null,null,null,null,null,null,null,null,1,1]
[null,null,{"$f":"IF(G192=0,\"0\",IF(U182=2,\"0\",IF(U182=1,(G192/100)*100,IF(U182=2,(G192/100)*100))))","v":"0"},{"$f":"G192","v":0},null,"Total",{"$f":"IF(SUM(G184:G191)=0,\"1\",SUM(G184:G191))","v":"1"},{"$f":"SUM(H184:H191)","v":0},{"$f":"SUM(I184:I191)","v":0},{"$f":"SUM(J184:J191)","v":0},{"$f":"SUM(K184:K191)","v":0},{"$f":"SUM(L184:L191)","v":0},null,{"$f":"SUM(H194:L194)","v":0},{"$f":"IF(G192<80,\"0,00\",IF(P193>0,\"0\",IF(G192>100,\"0,00\",IF(N184>=80,M184,IF(N184<80,0)))))","v":"0,00"},{"$f":"P184+P185+P186+P187+P188+P189+P190+P191","v":0},{"$f":"1","v":1},{"$f":"1","v":1}]
[null,null,null,null,null,null,"Percentage",{"$f":"IF(H193+G193=0,\"0\",(H193/G193)*100)","v":0},{"$f":"IF(I193+G193=0,\"0\",(I193/G193)*100)","v":0},{"$f":"IF(J193+G193=0,\"0\",(J193/G193)*100)","v":0},{"$f":"IF(K193+G193=0,\"0\",(K193/G193)*100)","v":0},{"$f":"IF(L193+G193=0,\"0\",(L193/G193)*100)","v":0},null,100,null,null,{"$f":"1","v":1},{"$f":"1","v":1}]
[null,null,null,null,null,{"$f":"IF(U182=1,((G193/100)*80))","v":0.8},"% of 80",{"$f":"(H194/80)*100","v":0},{"$f":"(I194/80)*100","v":0},{"$f":"(J194/80)*100","v":0},{"$f":"(K194/80)*100","v":0},{"$f":"(L194/80)*100","v":0},null,null,null,null,{"$f":"1","v":1},{"$f":"1","v":1}]
[null,null,null,null,null,null,"Limiter",{"$f":"IF(H195>100,\"100\",H195)","v":0},{"$f":"IF(I195>100,\"100\",I195)","v":0},{"$f":"IF(J195>100,\"100\",J195)","v":0},{"$f":"IF(K195>100,\"100\",K195)","v":0},{"$f":"IF(L195>100,\"100\",L195)","v":0},null,null,null,null,{"$f":"1","v":1},{"$f":"1","v":1}]
[null,null,null,null,null,null,null,null,{"$f":"IF(H196+I196+J196+K196+L196=0,0,100-(H196))","v":0},{"$f":"IF(H196+I196+J196+K196+L196=0,0,100-(H196+I196))","v":0},{"$f":"IF(J196+I196+H196+K196+L196=0,0,100-(J196+I196+H196))","v":0},{"$f":"IF(K196+J196+I196+H196+L196=0,0,100-(H196+I196+K196+J196))","v":0},null,null,null,null,{"$f":"1","v":1},{"$f":"1","v":1}]
[null,null,null,null,null,null,null,null,{"$f":"IF(I196>I197,I197,I196)","v":0},{"$f":"IF(J196>J197,J197,J196)","v":0},{"$f":"IF(K196>K197,K197,K196)","v":0},{"$f":"IF(L196>L197,L197,L196)","v":0},null,null,null,null,{"$f":"1","v":1},{"$f":"1","v":1}]
[null,null,null,null,null,null,null,null,null,null,null,{"$f":"IF(K198+J196+H196+I196>=100,0,L198)","v":0},null,null,null,null,{"$f":"1","v":1},{"$f":"1","v":1}]
[null,null,null,null,null,null,"Scores",{"$f":"IF(H193=0,0,0.01*(H196*H201))","v":0},{"$f":"IF(I193=0,0,0.01*(I198*I201))","v":0},{"$f":"IF(J193=0,0,0.01*(J198*J201))","v":0},{"$f":"IF(K193=0,0,0.01*(K198*K201))","v":0},{"$f":"IF(L193=0,0,0.01*(L199*L201))","v":0},null,null,null,null,{"$f":"1","v":1},{"$f":"1","v":1}]
[null,null,null,null,null,null,null,3,2.5,2,1.5,1,"Total",null,null,null,{"$f":"1","v":1},{"$f":"1","v":1}]
[null,null,"ETASJESKILLERE (2)",null,null,"Velg datatype:",null,null,null,null,null,null,null,null,null,null,{"$f":"IF(freq3>=4,0,1)","v":1},{"$f":"1","v":1},null,null,{"$f":"IF(G202=\"\",2,IF(ISERROR(VLOOKUP(G202,$T$1246:$U$1247,2,FALSE)),\"\",VLOOKUP(G202,$T$1246:$U$1247,2,FALSE)))","v":2}]
[null,null,null,{"$f":"IF(AND(P213>=1,type1=1),\"NB! Volum av nivåene kan ikke være større enn det totale volumet for hvert enkelt materiale!\",+IF(AND(P213>=1,type1=2),\"NB! Prosentandel for hvert nivå må registreres i prosent av det vurderte bygningselementet, og den totale prosentandelen kan ikke være større enn den totale prosent av hvert enkelt materiale!\",\"\"))","v":""},null,null,null,null,null,null,null,null,null,null,null,null,1,{"$f":"1","v":1}]
[null,null,{"$f":"IF(G202=\"\",\"\",IF(SUM(G204:G211)=0,\"\",IF(U202=1,IF(U202+L212=1,\"REGISTRER DET TOTALE VOLUMET AV RELEVANTE MATERIALER\",IF((U202+G212+L212)=1,\"REGISTRER DET TOTALE VOLUMET AV RELEVANTE MATERIALER\",IF(ISERROR(C213),\"REGISTRER DET TOTALE VOLUMET AV RELEVANTE MATERIALER\",IF(OR(G204>L212,G205>L212,G206>L212,G207>L212,G208>L212,G209>L212,G210>L212,G211>L212),\"Volumet av de enkelte materialer kan ikke overstige mengden relevante materialer\",IF(SUM(G204:G211)>L212,\"Den totale mengden av materialer kan ikke overstige det  totale volumet av relevante materialer\",\"\"))))),IF(U202=2,IF(SUM(G204:G211)<80,\"Minst 80 % av de relevante materialer må vurderes, vennligst beregn på nytt.\",IF(OR(G204>100,G205>100,G206>100,G207>100,G208>100,G209>100,G210>100,G211>100),\"Prosentandel av de enkelte materialerer kan ikke overstige 100\",IF(SUM(G204:G211)>100,\"Den totale prosentandelen av materialer kan ikke overstige 100\",\"\")))))))","v":""},null,"Mat. 1",null,null,null,null,null,null,null,{"$f":"IF(SUM(H220+I220+J220+K220+L220)>=3,\"3,00\",SUM(H220+I220+J220+K220+L220))","v":0},{"$f":"IF(AND(U206=1,L212=\"\"),0,IF(OR(NOT(D203=\"\"),NOT(C204=\"\"),NOT(N205=\"\")),0,IF(ISERROR(N213),\"0\",N213)))","v":0},null,{"$f":"IF(SUM(H204:L204)>G204,\"1\",\"0\")","v":"0"},1,{"$f":"1","v":1}]
[null,null,null,null,"Mat. 2",null,null,null,null,null,null,null,null,{"$f":"IF(AND(U202=1,L212=\"\"),C204,+IF(G213>L212,C204,(IF(N213<80,\"Ingen poeng oppnådd,\nmindre enn 80 % oppfyller kravet\",\"\"))))","v":""},null,{"$f":"IF(SUM(H205:L205)>G205,\"1\",\"0\")","v":"0"},1,{"$f":"1","v":1}]
[null,null,null,null,"Mat. 3",null,null,null,null,null,null,null,null,null,null,"0",1,{"$f":"1","v":1}]
[null,null,null,null,"Mat. 4",null,null,null,null,null,null,null,null,null,null,"0",1,{"$f":"1","v":1}]
[null,null,null,null,"Mat. 5",null,null,null,null,null,null,null,null,null,null,"0",1,{"$f":"1","v":1}]
[null,null,null,null,"Mat. 6",null,null,null,null,null,null,null,null,null,null,"0",1,{"$f":"1","v":1}]
[null,null,null,null,"Mat. 7",null,null,null,null,null,null,null,null,null,null,"0",1,{"$f":"1","v":1}]
[null,null,null,null,"Mat. 8",null,null,null,null,null,null,null,null,null,null,"0",1,{"$f":"1","v":1}]
[null,null,null,null,"Totalt % av bygningselementet (relevante materialer) vurdert:",null,{"$f":"IF(U202=\"\",0,IF(U202+L212=1,0,IF(SUM(G204:G211)=0,0,IF(U202=1,IF(OR(G204>L212,G205>L212,G206>L212,G207>L212,G208>L212,G209>L212,G210>L212,G211>L212,SUM(G204:G211)>L212),0,((SUM(G204:G211)/L212)*100)),IF(U202=2,IF(OR(G204>100,G205>100,G206>100,G207>100,G208>100,G209>100,G210>100,G211>100,SUM(G204:G211)>100),0,SUM(G204:G211)))))))","v":0},"Samlet volum for aktuelle elementer:",null,null,null,null,null,null,null,null,1,{"$f":"1","v":1}]
[null,null,{"$f":"IF(G212=0,\"0\",IF(U202=2,\"0\",IF(U202=1,(G212/100)*100,IF(U202=2,(G212/100)*100))))","v":"0"},{"$f":"G212","v":0},null,"Total",{"$f":"IF(SUM(G204:G211)=0,\"1\",SUM(G204:G211))","v":"1"},{"$f":"SUM(H204:H211)","v":0},{"$f":"SUM(I204:I211)","v":0},{"$f":"SUM(J204:J211)","v":0},{"$f":"SUM(K204:K211)","v":0},{"$f":"SUM(L204:L211)","v":0},null,{"$f":"SUM(H214:L214)","v":0},{"$f":"IF(G212<80,\"0,00\",IF(P213>0,\"0\",IF(G212>100,\"0,00\",IF(N204>=80,M204,IF(N204<80,0)))))","v":"0,00"},{"$f":"P204+P205+P206+P207+P208+P209+P210+P211","v":0},{"$f":"1","v":1},{"$f":"1","v":1}]
[null,null,null,null,null,null,"Percentage",{"$f":"IF(H213+G213=0,\"0\",(H213/G213)*100)","v":0},{"$f":"IF(I213+G213=0,\"0\",(I213/G213)*100)","v":0},{"$f":"IF(J213+G213=0,\"0\",(J213/G213)*100)","v":0},{"$f":"IF(K213+G213=0,\"0\",(K213/G213)*100)","v":0},{"$f":"IF(L213+G213=0,\"0\",(L213/G213)*100)","v":0},null,100,null,null,{"$f":"1","v":1},{"$f":"1","v":1}]
[null,null,null,null,null,{"$f":"IF(U202=1,((G213/100)*80))","v":false},"% of 80",{"$f":"(H214/80)*100","v":0},{"$f":"(I214/80)*100","v":0},{"$f":"(J214/80)*100","v":0},{"$f":"(K214/80)*100","v":0},{"$f":"(L214/80)*100","v":0},null,null,null,null,{"$f":"1","v":1},{"$f":"1","v":1}]
[null,null,null,null,null,null,"Limiter",{"$f":"IF(H215>100,\"100\",H215)","v":0},{"$f":"IF(I215>100,\"100\",I215)","v":0},{"$f":"IF(J215>100,\"100\",J215)","v":0},{"$f":"IF(K215>100,\"100\",K215)","v":0},{"$f":"IF(L215>100,\"100\",L215)","v":0},null,null,null,null,{"$f":"1","v":1},{"$f":"1","v":1}]
[null,null,null,null,null,null,null,null,{"$f":"IF(H216+I216+J216+K216+L216=0,0,100-(H216))","v":0},{"$f":"IF(H216+I216+J216+K216+L216=0,0,100-(H216+I216))","v":0},{"$f":"IF(J216+I216+H216+K216+L216=0,0,100-(J216+I216+H216))","v":0},{"$f":"IF(K216+J216+I216+H216+L216=0,0,100-(H216+I216+K216+J216))","v":0},null,null,null,null,{"$f":"1","v":1},{"$f":"1","v":1}]
[null,null,null,null,null,null,null,null,{"$f":"IF(I216>I217,I217,I216)","v":0},{"$f":"IF(J216>J217,J217,J216)","v":0},{"$f":"IF(K216>K217,K217,K216)","v":0},{"$f":"IF(L216>L217,L217,L216)","v":0},null,null,null,null,{"$f":"1","v":1},{"$f":"1","v":1}]
[null,null,null,null,null,null,null,null,null,null,null,{"$f":"IF(K218+J216+H216+I216>=100,0,L218)","v":0},null,null,null,null,{"$f":"1","v":1},{"$f":"1","v":1}]
[null,null,null,null,null,null,"Scores",{"$f":"IF(H213=0,0,0.01*(H216*H221))","v":0},{"$f":"IF(I213=0,0,0.01*(I218*I221))","v":0},{"$f":"IF(J213=0,0,0.01*(J218*J221))","v":0},{"$f":"IF(K213=0,0,0.01*(K218*K221))","v":0},{"$f":"IF(L213=0,0,0.01*(L219*L221))","v":0},null,null,null,null,{"$f":"1","v":1},{"$f":"1","v":1}]
[null,null,null,null,null,null,null,3,2.5,2,1.5,1,null,null,null,null,{"$f":"1","v":1},{"$f":"1","v":1}]
[null,null,"ETASJESKILLERE (3)",null,null,"Velg datatype:",null,null,null,null,null,null,null,null,null,null,{"$f":"IF(freq3>=5,0,1)","v":1},{"$f":"1","v":1},null,null,{"$f":"IF(G222=\"\",2,IF(ISERROR(VLOOKUP(G222,$T$1246:$U$1247,2,FALSE)),\"\",VLOOKUP(G222,$T$1246:$U$1247,2,FALSE)))","v":2}]
[null,null,null,{"$f":"IF(AND(P233>=1,type1=1),\"NB! Volum av nivåene kan ikke være større enn det totale volumet for hvert enkelt materiale!\",+IF(AND(P233>=1,type1=2),\"NB! Prosentandel for hvert nivå må registreres i prosent av det vurderte bygningselementet, og den totale prosentandelen kan ikke være større enn den totale prosent av hvert enkelt materiale!\",\"\"))","v":""},null,null,null,null,null,null,null,null,null,null,null,null,1,{"$f":"1","v":1}]
[null,null,{"$f":"IF(G222=\"\",\"\",IF(SUM(G224:G231)=0,\"\",IF(U222=1,IF(U222+L232=1,\"REGISTRER DET TOTALE VOLUMET AV RELEVANTE MATERIALER\",IF((U222+G232+L232)=1,\"REGISTRER DET TOTALE VOLUMET AV RELEVANTE MATERIALER\",IF(ISERROR(C233),\"REGISTRER DET TOTALE VOLUMET AV RELEVANTE MATERIALER\",IF(OR(G224>L232,G225>L232,G226>L232,G227>L232,G228>L232,G229>L232,G230>L232,G231>L232),\"Volumet av de enkelte materialer kan ikke overstige mengden relevante materialer\",IF(SUM(G224:G231)>L232,\"Den totale mengden av materialer kan ikke overstige det  totale volumet av relevante materialer\",\"\"))))),IF(U222=2,IF(SUM(G224:G231)<80,\"Minst 80 % av de relevante materialer må vurderes, vennligst beregn på nytt.\",IF(OR(G224>100,G225>100,G226>100,G227>100,G228>100,G229>100,G230>100,G231>100),\"Prosentandel av de enkelte materialerer kan ikke overstige 100\",IF(SUM(G224:G231)>100,\"Den totale prosentandelen av materialer kan ikke overstige 100\",\"\")))))))","v":""},null,"Mat. 1",null,null,null,null,null,null,null,{"$f":"IF(SUM(H240+I240+J240+K240+L240)>=3,\"3,00\",SUM(H240+I240+J240+K240+L240))","v":0},{"$f":"IF(AND(U226=1,L232=\"\"),0,IF(OR(NOT(D223=\"\"),NOT(C224=\"\"),NOT(N225=\"\")),0,IF(ISERROR(N233),\"0\",N233)))","v":0},null,{"$f":"IF(SUM(H224:L224)>G224,\"1\",\"0\")","v":"0"},1,{"$f":"1","v":1}]
[null,null,null,null,"Mat. 2",null,null,null,null,null,null,null,null,{"$f":"IF(AND(U222=1,L232=\"\"),C224,+IF(G233>L232,C224,(IF(N233<80,\"Ingen poeng oppnådd,\nmindre enn 80 % oppfyller kravet\",\"\"))))","v":""},null,{"$f":"IF(SUM(H225:L225)>G225,\"1\",\"0\")","v":"0"},1,{"$f":"1","v":1}]
[null,null,null,null,"Mat. 3",null,null,null,null,null,null,null,null,null,null,"0",1,{"$f":"1","v":1}]
[null,null,null,null,"Mat. 4",null,null,null,null,null,null,null,null,null,null,"0",1,{"$f":"1","v":1}]
[null,null,null,null,"Mat. 5",null,null,null,null,null,null,null,null,null,null,"0",1,{"$f":"1","v":1}]
[null,null,null,null,"Mat. 6",null,null,null,null,null,null,null,null,null,null,"0",1,{"$f":"1","v":1}]
[null,null,null,null,"Mat. 7",null,null,null,null,null,null,null,null,null,null,"0",1,{"$f":"1","v":1}]
[null,null,null,null,"Mat. 8",null,null,null,null,null,null,null,null,null,null,"0",1,{"$f":"1","v":1}]
[null,null,null,null,"Totalt % av bygningselementet (relevante materialer) vurdert:",null,{"$f":"IF(U222=\"\",0,IF(U222+L232=1,0,IF(SUM(G224:G231)=0,0,IF(U222=1,IF(OR(G224>L232,G225>L232,G226>L232,G227>L232,G228>L232,G229>L232,G230>L232,G231>L232,SUM(G224:G231)>L232),0,((SUM(G224:G231)/L232)*100)),IF(U222=2,IF(OR(G224>100,G225>100,G226>100,G227>100,G228>100,G229>100,G230>100,G231>100,SUM(G224:G231)>100),0,SUM(G224:G231)))))))","v":0},"Samlet volum for aktuelle elementer:",null,null,null,null,null,null,null,null,1,{"$f":"1","v":1}]
[null,null,{"$f":"IF(G232=0,\"0\",IF(U222=2,\"0\",IF(U222=1,(G232/100)*100,IF(U222=2,(G232/100)*100))))","v":"0"},{"$f":"G232","v":0},null,"Total",{"$f":"IF(SUM(G224:G231)=0,\"1\",SUM(G224:G231))","v":"1"},{"$f":"SUM(H224:H231)","v":0},{"$f":"SUM(I224:I231)","v":0},{"$f":"SUM(J224:J231)","v":0},{"$f":"SUM(K224:K231)","v":0},{"$f":"SUM(L224:L231)","v":0},null,{"$f":"SUM(H234:L234)","v":0},{"$f":"IF(G232<80,\"0,00\",IF(P233>0,\"0\",IF(G232>100,\"0,00\",IF(N224>=80,M224,IF(N224<80,0)))))","v":"0,00"},{"$f":"P224+P225+P226+P227+P228+P229+P230+P231","v":0},{"$f":"1","v":1},{"$f":"1","v":1}]
[null,null,null,null,null,null,"Percentage",{"$f":"IF(H233+G233=0,\"0\",(H233/G233)*100)","v":0},{"$f":"IF(I233+G233=0,\"0\",(I233/G233)*100)","v":0},{"$f":"IF(J233+G233=0,\"0\",(J233/G233)*100)","v":0},{"$f":"IF(K233+G233=0,\"0\",(K233/G233)*100)","v":0},{"$f":"IF(L233+G233=0,\"0\",(L233/G233)*100)","v":0},null,100,null,null,{"$f":"1","v":1},{"$f":"1","v":1}]
[null,null,null,null,null,{"$f":"IF(U222=1,((G233/100)*80))","v":false},"% of 80",{"$f":"(H234/80)*100","v":0},{"$f":"(I234/80)*100","v":0},{"$f":"(J234/80)*100","v":0},{"$f":"(K234/80)*100","v":0},{"$f":"(L234/80)*100","v":0},null,null,null,null,{"$f":"1","v":1},{"$f":"1","v":1}]
[null,null,null,null,null,null,"Limiter",{"$f":"IF(H235>100,\"100\",H235)","v":0},{"$f":"IF(I235>100,\"100\",I235)","v":0},{"$f":"IF(J235>100,\"100\",J235)","v":0},{"$f":"IF(K235>100,\"100\",K235)","v":0},{"$f":"IF(L235>100,\"100\",L235)","v":0},null,null,null,null,{"$f":"1","v":1},{"$f":"1","v":1}]
[null,null,null,null,null,null,null,null,{"$f":"IF(H236+I236+J236+K236+L236=0,0,100-(H236))","v":0},{"$f":"IF(H236+I236+J236+K236+L236=0,0,100-(H236+I236))","v":0},{"$f":"IF(J236+I236+H236+K236+L236=0,0,100-(J236+I236+H236))","v":0},{"$f":"IF(K236+J236+I236+H236+L236=0,0,100-(H236+I236+K236+J236))","v":0},null,null,null,null,{"$f":"1","v":1},{"$f":"1","v":1}]
[null,null,null,null,null,null,null,null,{"$f":"IF(I236>I237,I237,I236)","v":0},{"$f":"IF(J236>J237,J237,J236)","v":0},{"$f":"IF(K236>K237,K237,K236)","v":0},{"$f":"IF(L236>L237,L237,L236)","v":0},null,null,null,null,{"$f":"1","v":1},{"$f":"1","v":1}]
[null,null,null,null,null,null,null,null,null,null,null,{"$f":"IF(K238+J236+H236+I236>=100,0,L238)","v":0},null,null,null,null,{"$f":"1","v":1},{"$f":"1","v":1}]
[null,null,null,null,null,null,"Scores",{"$f":"IF(H233=0,0,0.01*(H236*H241))","v":0},{"$f":"IF(I233=0,0,0.01*(I238*I241))","v":0},{"$f":"IF(J233=0,0,0.01*(J238*J241))","v":0},{"$f":"IF(K233=0,0,0.01*(K238*K241))","v":0},{"$f":"IF(L233=0,0,0.01*(L239*L241))","v":0},null,null,null,null,{"$f":"1","v":1},{"$f":"1","v":1}]
[null,null,null,null,null,null,null,3,2.5,2,1.5,1,null,null,null,null,{"$f":"1","v":1},{"$f":"1","v":1}]
[null,null,"ETASJESKILLERE (4)",null,null,"Velg datatype:",null,null,null,null,null,null,null,null,null,null,{"$f":"IF(freq3>=6,0,1)","v":1},{"$f":"1","v":1},null,null,{"$f":"IF(G242=\"\",2,IF(ISERROR(VLOOKUP(G242,$T$1246:$U$1247,2,FALSE)),\"\",VLOOKUP(G242,$T$1246:$U$1247,2,FALSE)))","v":2}]
[null,null,null,{"$f":"IF(AND(P253>=1,type1=1),\"NB! Volum av nivåene kan ikke være større enn det totale volumet for hvert enkelt materiale!\",+IF(AND(P253>=1,type1=2),\"NB! Prosentandel for hvert nivå må registreres i prosent av det vurderte bygningselementet, og den totale prosentandelen kan ikke være større enn den totale prosent av hvert enkelt materiale!\",\"\"))","v":""},null,null,null,null,null,null,null,null,null,null,null,null,1,{"$f":"1","v":1}]
[null,null,{"$f":"IF(G242=\"\",\"\",IF(SUM(G244:G251)=0,\"\",IF(U242=1,IF(U242+L252=1,\"REGISTRER DET TOTALE VOLUMET AV RELEVANTE MATERIALER\",IF((U242+G252+L252)=1,\"REGISTRER DET TOTALE VOLUMET AV RELEVANTE MATERIALER\",IF(ISERROR(C253),\"REGISTRER DET TOTALE VOLUMET AV RELEVANTE MATERIALER\",IF(OR(G244>L252,G245>L252,G246>L252,G247>L252,G248>L252,G249>L252,G250>L252,G251>L252),\"Volumet av de enkelte materialer kan ikke overstige mengden relevante materialer\",IF(SUM(G244:G251)>L252,\"Den totale mengden av materialer kan ikke overstige det  totale volumet av relevante materialer\",\"\"))))),IF(U242=2,IF(SUM(G244:G251)<80,\"Minst 80 % av de relevante materialer må vurderes, vennligst beregn på nytt.\",IF(OR(G244>100,G245>100,G246>100,G247>100,G248>100,G249>100,G250>100,G251>100),\"Prosentandel av de enkelte materialerer kan ikke overstige 100\",IF(SUM(G244:G251)>100,\"Den totale prosentandelen av materialer kan ikke overstige 100\",\"\")))))))","v":""},null,"Mat. 1",null,null,null,null,null,null,null,{"$f":"IF(SUM(H260+I260+J260+K260+L260)>=3,\"3,00\",SUM(H260+I260+J260+K260+L260))","v":0},{"$f":"IF(AND(U246=1,L252=\"\"),0,IF(OR(NOT(D243=\"\"),NOT(C244=\"\"),NOT(N245=\"\")),0,IF(ISERROR(N253),\"0\",N253)))","v":0},null,{"$f":"IF(SUM(H244:L244)>G244,\"1\",\"0\")","v":"0"},1,{"$f":"1","v":1}]
[null,null,null,null,"Mat. 2",null,null,null,null,null,null,null,null,{"$f":"IF(AND(U242=1,L252=\"\"),C244,+IF(G253>L252,C244,(IF(N253<80,\"Ingen poeng oppnådd,\nmindre enn 80 % oppfyller kravet\",\"\"))))","v":""},null,{"$f":"IF(SUM(H245:L245)>G245,\"1\",\"0\")","v":"0"},1,{"$f":"1","v":1}]
[null,null,null,null,"Mat. 3",null,null,null,null,null,null,null,null,null,null,"0",1,{"$f":"1","v":1}]
[null,null,null,null,"Mat. 4",null,null,null,null,null,null,null,null,null,null,"0",1,{"$f":"1","v":1}]
[null,null,null,null,"Mat. 5",null,null,null,null,null,null,null,null,null,null,"0",1,{"$f":"1","v":1}]
[null,null,null,null,"Mat. 6",null,null,null,null,null,null,null,null,null,null,"0",1,{"$f":"1","v":1}]
[null,null,null,null,"Mat. 7",null,null,null,null,null,null,null,null,null,null,"0",1,{"$f":"1","v":1}]
[null,null,null,null,"Mat. 8",null,null,null,null,null,null,null,null,null,null,"0",1,{"$f":"1","v":1}]
[null,null,null,null,"Totalt % av bygningselementet (relevante materialer) vurdert:",null,{"$f":"IF(U242=\"\",0,IF(U242+L252=1,0,IF(SUM(G244:G251)=0,0,IF(U242=1,IF(OR(G244>L252,G245>L252,G246>L252,G247>L252,G248>L252,G249>L252,G250>L252,G251>L252,SUM(G244:G251)>L252),0,((SUM(G244:G251)/L252)*100)),IF(U242=2,IF(OR(G244>100,G245>100,G246>100,G247>100,G248>100,G249>100,G250>100,G251>100,SUM(G244:G251)>100),0,SUM(G244:G251)))))))","v":0},"Samlet volum for aktuelle elementer:",null,null,null,null,null,null,null,null,1,{"$f":"1","v":1}]
[null,null,{"$f":"IF(G252=0,\"0\",IF(U242=2,\"0\",IF(U242=1,(G252/100)*100,IF(U242=2,(G252/100)*100))))","v":"0"},{"$f":"G252","v":0},null,"Total",{"$f":"IF(SUM(G244:G251)=0,\"1\",SUM(G244:G251))","v":"1"},{"$f":"SUM(H244:H251)","v":0},{"$f":"SUM(I244:I251)","v":0},{"$f":"SUM(J244:J251)","v":0},{"$f":"SUM(K244:K251)","v":0},{"$f":"SUM(L244:L251)","v":0},null,{"$f":"SUM(H254:L254)","v":0},{"$f":"IF(G252<80,\"0,00\",IF(P253>0,\"0\",IF(G252>100,\"0,00\",IF(N244>=80,M244,IF(N244<80,0)))))","v":"0,00"},{"$f":"P244+P245+P246+P247+P248+P249+P250+P251","v":0},{"$f":"1","v":1},{"$f":"1","v":1}]
[null,null,null,null,null,null,"Percentage",{"$f":"IF(H253+G253=0,\"0\",(H253/G253)*100)","v":0},{"$f":"IF(I253+G253=0,\"0\",(I253/G253)*100)","v":0},{"$f":"IF(J253+G253=0,\"0\",(J253/G253)*100)","v":0},{"$f":"IF(K253+G253=0,\"0\",(K253/G253)*100)","v":0},{"$f":"IF(L253+G253=0,\"0\",(L253/G253)*100)","v":0},null,100,null,null,{"$f":"1","v":1},{"$f":"1","v":1}]
[null,null,null,null,null,{"$f":"IF(U242=1,((G253/100)*80))","v":false},"% of 80",{"$f":"(H254/80)*100","v":0},{"$f":"(I254/80)*100","v":0},{"$f":"(J254/80)*100","v":0},{"$f":"(K254/80)*100","v":0},{"$f":"(L254/80)*100","v":0},null,null,null,null,{"$f":"1","v":1},{"$f":"1","v":1}]
[null,null,null,null,null,null,"Limiter",{"$f":"IF(H255>100,\"100\",H255)","v":0},{"$f":"IF(I255>100,\"100\",I255)","v":0},{"$f":"IF(J255>100,\"100\",J255)","v":0},{"$f":"IF(K255>100,\"100\",K255)","v":0},{"$f":"IF(L255>100,\"100\",L255)","v":0},null,null,null,null,{"$f":"1","v":1},{"$f":"1","v":1}]
[null,null,null,null,null,null,null,null,{"$f":"IF(H256+I256+J256+K256+L256=0,0,100-(H256))","v":0},{"$f":"IF(H256+I256+J256+K256+L256=0,0,100-(H256+I256))","v":0},{"$f":"IF(J256+I256+H256+K256+L256=0,0,100-(J256+I256+H256))","v":0},{"$f":"IF(K256+J256+I256+H256+L256=0,0,100-(H256+I256+K256+J256))","v":0},null,null,null,null,{"$f":"1","v":1},{"$f":"1","v":1}]
[null,null,null,null,null,null,null,null,{"$f":"IF(I256>I257,I257,I256)","v":0},{"$f":"IF(J256>J257,J257,J256)","v":0},{"$f":"IF(K256>K257,K257,K256)","v":0},{"$f":"IF(L256>L257,L257,L256)","v":0},null,null,null,null,{"$f":"1","v":1},{"$f":"1","v":1}]
[null,null,null,null,null,null,null,null,null,null,null,{"$f":"IF(K258+J256+H256+I256>=100,0,L258)","v":0},null,null,null,null,{"$f":"1","v":1},{"$f":"1","v":1}]
[null,null,null,null,null,null,"Scores",{"$f":"IF(H253=0,0,0.01*(H256*H261))","v":0},{"$f":"IF(I253=0,0,0.01*(I258*I261))","v":0},{"$f":"IF(J253=0,0,0.01*(J258*J261))","v":0},{"$f":"IF(K253=0,0,0.01*(K258*K261))","v":0},{"$f":"IF(L253=0,0,0.01*(L259*L261))","v":0},null,null,null,null,{"$f":"1","v":1},{"$f":"1","v":1}]
[null,null,null,null,null,null,null,3,2.5,2,1.5,1,null,null,null,null,{"$f":"1","v":1},{"$f":"1","v":1}]
[null,null,"YTTERTAK",null,null,"Velg antall yttertak du ønsker å vurdere (deretter trykk «velg»):",null,null,null,null,{"$f":"IF(AND(G262=\"\",G273>0),\"NB! Husk å velge antall elementer...\",\"\")","v":""},null,null,null,{"$f":"IF(ISERROR(O274+O294+O314+O334)/V263,\"\",(O274+O294+O314+O334)/V263)","v":0},null,{"$f":"0","v":0},{"$f":"IF(asstype=2,0,1)","v":1},null,{"$f":"VLOOKUP(G262,$T$1239:$U$1243,2,FALSE)","v":2}]
[null,null,{"$f":"IF(G262=\"\",\"YTTERTAK\",\"YTTERTAK (1)\")","v":"YTTERTAK"},null,null,"Velg datatype:",null,null,null,null,null,null,null,null,null,null,{"$f":"IF(freq4>=3,0,1)","v":1},1,null,null,{"$f":"IF(G263=\"\",2,IF(ISERROR(VLOOKUP(G263,$T$1246:$U$1247,2,FALSE)),\"\",VLOOKUP(G263,$T$1246:$U$1247,2,FALSE)))","v":2},{"$f":"IF(freq4=3,1,IF(freq4=4,2,IF(freq4=5,3,IF(freq4=6,4,1))))","v":1}]
[null,null,null,{"$f":"IF(AND(P274>=1,type1=1),\"NB! Volum av nivåene kan ikke være større enn det totale volumet for hvert enkelt materiale!\",+IF(AND(P274>=1,type1=2),\"NB! Prosentandel for hvert nivå må registreres i prosent av det vurderte bygningselementet, og den totale prosentandelen kan ikke være større enn den totale prosent av hvert enkelt materiale!\",\"\"))","v":""},null,null,null,null,null,null,null,null,null,null,null,null,1,1]
[null,null,{"$f":"IF(G263=\"\",\"\",IF(SUM(G265:G272)=0,\"\",IF(U263=1,IF(U263+L273=1,\"REGISTRER DET TOTALE VOLUMET AV RELEVANTE MATERIALER\",IF((U263+G273+L273)=1,\"REGISTRER DET TOTALE VOLUMET AV RELEVANTE MATERIALER\",IF(ISERROR(C274),\"REGISTRER DET TOTALE VOLUMET AV RELEVANTE MATERIALER\",IF(OR(G265>L273,G266>L273,G267>L273,G268>L273,G269>L273,G270>L273,G271>L273,G272>L273),\"Volumet av de enkelte materialer kan ikke overstige mengden relevante materialer\",IF(SUM(G265:G272)>L273,\"Den totale mengden av materialer kan ikke overstige det  totale volumet av relevante materialer\",\"\"))))),IF(U263=2,IF(SUM(G265:G272)<80,\"Minst 80 % av de relevante materialer må vurderes, vennligst beregn på nytt.\",IF(OR(G265>100,G266>100,G267>100,G268>100,G269>100,G270>100,G271>100,G272>100),\"Prosentandel av de enkelte materialerer kan ikke overstige 100\",IF(SUM(G265:G272)>100,\"Den totale prosentandelen av materialer kan ikke overstige 100\",\"\")))))))","v":""},null,"Mat. 1",null,null,null,null,null,null,null,{"$f":"IF(SUM(H281+I281+J281+K281+L281)>=3,\"3,00\",SUM(H281+I281+J281+K281+L281))","v":0},{"$f":"IF(AND(U263=1,L273=\"\"),0,IF(OR(NOT(D264=\"\"),NOT(C265=\"\"),NOT(N266=\"\")),0,IF(ISERROR(N274),\"0\",N274)))","v":0},null,{"$f":"IF(SUM(H265:L265)>G265,\"1\",\"0\")","v":"0"},{"$f":"IF(freq4>=3,0,1)","v":1},1]
[null,null,null,null,"Mat. 2",null,null,null,null,null,null,null,null,{"$f":"IF(AND(U263=1,L273=\"\"),C265,+IF(G274>L273,C265,(IF(N274<80,\"Ingen poeng oppnådd,\nmindre enn 80 % oppfyller kravet\",\"\"))))","v":""},null,{"$f":"IF(SUM(H266:L266)>G266,\"1\",\"0\")","v":"0"},1,1]
[null,null,null,null,"Mat. 3",null,null,null,null,null,null,null,null,null,null,"0",1,1]
[null,null,null,null,"Mat. 4",null,null,null,null,null,null,null,null,null,null,"0",1,1]
[null,null,null,null,"Mat. 5",null,null,null,null,null,null,null,null,null,null,"0",1,1]
[null,null,null,null,"Mat. 6",null,null,null,null,null,null,null,null,null,null,"0",1,1]
[null,null,null,null,"Mat. 7",null,null,null,null,null,null,null,null,null,null,"0",1,1]
[null,null,null,null,"Mat. 8",null,null,null,null,null,null,null,null,null,null,"0",1,1]
[null,null,null,null,"Totalt % av bygningselementet (relevante materialer) vurdert:",null,{"$f":"IF(U263=\"\",0,IF(U263+L273=1,0,IF(SUM(G265:G272)=0,0,IF(U263=1,IF(OR(G265>L273,G266>L273,G267>L273,G268>L273,G269>L273,G270>L273,G271>L273,G272>L273,SUM(G265:G272)>L273),0,((SUM(G265:G272)/L273)*100)),IF(U263=2,IF(OR(G265>100,G266>100,G267>100,G268>100,G269>100,G270>100,G271>100,G272>100,SUM(G265:G272)>100),0,SUM(G265:G272)))))))","v":0},"Samlet volum for aktuelle elementer:",null,null,null,null,null,null,null,null,1,1]
[null,null,{"$f":"IF(G273=0,\"0\",IF(U263=2,\"0\",IF(U263=1,(G273/100)*100,IF(U263=2,(G273/100)*100))))","v":"0"},{"$f":"G273","v":0},null,"Total",{"$f":"IF(SUM(G265:G272)=0,\"1\",SUM(G265:G272))","v":"1"},{"$f":"SUM(H265:H272)","v":0},{"$f":"SUM(I265:I272)","v":0},{"$f":"SUM(J265:J272)","v":0},{"$f":"SUM(K265:K272)","v":0},{"$f":"SUM(L265:L272)","v":0},null,{"$f":"SUM(H275:L275)","v":0},{"$f":"IF(G273<80,\"0,00\",IF(P274>0,\"0\",IF(G273>100,\"0,00\",IF(N265>=80,M265,IF(N265<80,0)))))","v":"0,00"},{"$f":"P265+P266+P267+P268+P269+P270+P271+P272","v":0},{"$f":"1","v":1},{"$f":"1","v":1}]
[null,null,null,null,null,null,"Percentage",{"$f":"IF(H274+G274=0,\"0\",(H274/G274)*100)","v":0},{"$f":"IF(I274+G274=0,\"0\",(I274/G274)*100)","v":0},{"$f":"IF(J274+G274=0,\"0\",(J274/G274)*100)","v":0},{"$f":"IF(K274+G274=0,\"0\",(K274/G274)*100)","v":0},{"$f":"IF(L274+G274=0,\"0\",(L274/G274)*100)","v":0},null,100,null,null,{"$f":"1","v":1},{"$f":"1","v":1}]
[null,null,null,null,null,{"$f":"IF(U263=1,((G274/100)*80))","v":false},"% of 80",{"$f":"(H275/80)*100","v":0},{"$f":"(I275/80)*100","v":0},{"$f":"(J275/80)*100","v":0},{"$f":"(K275/80)*100","v":0},{"$f":"(L275/80)*100","v":0},null,null,null,null,{"$f":"1","v":1},{"$f":"1","v":1}]
[null,null,null,null,null,null,"Limiter",{"$f":"IF(H276>100,\"100\",H276)","v":0},{"$f":"IF(I276>100,\"100\",I276)","v":0},{"$f":"IF(J276>100,\"100\",J276)","v":0},{"$f":"IF(K276>100,\"100\",K276)","v":0},{"$f":"IF(L276>100,\"100\",L276)","v":0},null,null,null,null,{"$f":"1","v":1},{"$f":"1","v":1}]
[null,null,null,null,null,null,null,null,{"$f":"IF(H277+I277+J277+K277+L277=0,0,100-(H277))","v":0},{"$f":"IF(H277+I277+J277+K277+L277=0,0,100-(H277+I277))","v":0},{"$f":"IF(J277+I277+H277+K277+L277=0,0,100-(J277+I277+H277))","v":0},{"$f":"IF(K277+J277+I277+H277+L277=0,0,100-(H277+I277+K277+J277))","v":0},null,null,null,null,{"$f":"1","v":1},{"$f":"1","v":1}]
[null,null,null,null,null,null,null,null,{"$f":"IF(I277>I278,I278,I277)","v":0},{"$f":"IF(J277>J278,J278,J277)","v":0},{"$f":"IF(K277>K278,K278,K277)","v":0},{"$f":"IF(L277>L278,L278,L277)","v":0},null,null,null,null,{"$f":"1","v":1},{"$f":"1","v":1}]
[null,null,null,null,null,null,null,null,null,null,null,{"$f":"IF(K279+J277+H277+I277>=100,0,L279)","v":0},null,null,null,null,{"$f":"1","v":1},{"$f":"1","v":1}]
[null,null,null,null,null,null,"Scores",{"$f":"IF(H274=0,0,0.01*(H277*H282))","v":0},{"$f":"IF(I274=0,0,0.01*(I279*I282))","v":0},{"$f":"IF(J274=0,0,0.01*(J279*J282))","v":0},{"$f":"IF(K274=0,0,0.01*(K279*K282))","v":0},{"$f":"IF(L274=0,0,0.01*(L280*L282))","v":0},null,null,null,null,{"$f":"1","v":1},{"$f":"1","v":1}]
[null,null,null,null,null,null,null,3,2.5,2,1.5,1,null,null,null,null,{"$f":"1","v":1},{"$f":"1","v":1}]
[null,null,"YTTERTAK (2)",null,null,"Velg datatype:",null,null,null,null,null,null,null,null,null,null,{"$f":"IF(freq4>=4,0,1)","v":1},{"$f":"1","v":1},null,null,{"$f":"IF(G283=\"\",2,IF(ISERROR(VLOOKUP(G283,$T$1246:$U$1247,2,FALSE)),\"\",VLOOKUP(G283,$T$1246:$U$1247,2,FALSE)))","v":2}]
[null,null,null,{"$f":"IF(AND(P294>=1,type1=1),\"NB! Volum av nivåene kan ikke være større enn det totale volumet for hvert enkelt materiale!\",+IF(AND(P294>=1,type1=2),\"NB! Prosentandel for hvert nivå må registreres i prosent av det vurderte bygningselementet, og den totale prosentandelen kan ikke være større enn den totale prosent av hvert enkelt materiale!\",\"\"))","v":""},null,null,null,null,null,null,null,null,null,null,null,null,1,{"$f":"1","v":1}]
[null,null,{"$f":"IF(G283=\"\",\"\",IF(SUM(G285:G292)=0,\"\",IF(U283=1,IF(U283+L293=1,\"REGISTRER DET TOTALE VOLUMET AV RELEVANTE MATERIALER\",IF((U283+G293+L293)=1,\"REGISTRER DET TOTALE VOLUMET AV RELEVANTE MATERIALER\",IF(ISERROR(C294),\"REGISTRER DET TOTALE VOLUMET AV RELEVANTE MATERIALER\",IF(OR(G285>L293,G286>L293,G287>L293,G288>L293,G289>L293,G290>L293,G291>L293,G292>L293),\"Volumet av de enkelte materialer kan ikke overstige mengden relevante materialer\",IF(SUM(G285:G292)>L293,\"Den totale mengden av materialer kan ikke overstige det  totale volumet av relevante materialer\",\"\"))))),IF(U283=2,IF(SUM(G285:G292)<80,\"Minst 80 % av de relevante materialer må vurderes, vennligst beregn på nytt.\",IF(OR(G285>100,G286>100,G287>100,G288>100,G289>100,G290>100,G291>100,G292>100),\"Prosentandel av de enkelte materialerer kan ikke overstige 100\",IF(SUM(G285:G292)>100,\"Den totale prosentandelen av materialer kan ikke overstige 100\",\"\")))))))","v":""},null,"Mat. 1",null,null,null,null,null,null,null,{"$f":"IF(SUM(H301+I301+J301+K301+L301)>=3,\"3,00\",SUM(H301+I301+J301+K301+L301))","v":0},{"$f":"IF(AND(U287=1,L293=\"\"),0,IF(OR(NOT(D284=\"\"),NOT(C285=\"\"),NOT(N286=\"\")),0,IF(ISERROR(N294),\"0\",N294)))","v":0},null,{"$f":"IF(SUM(H285:L285)>G285,\"1\",\"0\")","v":"0"},1,{"$f":"1","v":1}]
[null,null,null,null,"Mat. 2",null,null,null,null,null,null,null,null,{"$f":"IF(AND(U283=1,L293=\"\"),C285,+IF(G294>L293,C285,(IF(N294<80,\"Ingen poeng oppnådd,\nmindre enn 80 % oppfyller kravet\",\"\"))))","v":""},null,{"$f":"IF(SUM(H286:L286)>G286,\"1\",\"0\")","v":"0"},1,{"$f":"1","v":1}]
[null,null,null,null,"Mat. 3",null,null,null,null,null,null,null,null,null,null,"0",1,{"$f":"1","v":1}]
[null,null,null,null,"Mat. 4",null,null,null,null,null,null,null,null,null,null,"0",1,{"$f":"1","v":1}]
[null,null,null,null,"Mat. 5",null,null,null,null,null,null,null,null,null,null,"0",1,{"$f":"1","v":1}]
[null,null,null,null,"Mat. 6",null,null,null,null,null,null,null,null,null,null,"0",1,{"$f":"1","v":1}]
[null,null,null,null,"Mat. 7",null,null,null,null,null,null,null,null,null,null,"0",1,{"$f":"1","v":1}]
[null,null,null,null,"Mat. 8",null,null,null,null,null,null,null,null,null,null,"0",1,{"$f":"1","v":1}]
[null,null,null,null,"Totalt % av bygningselementet (relevante materialer) vurdert:",null,{"$f":"IF(U283=\"\",0,IF(U283+L293=1,0,IF(SUM(G285:G292)=0,0,IF(U283=1,IF(OR(G285>L293,G286>L293,G287>L293,G288>L293,G289>L293,G290>L293,G291>L293,G292>L293,SUM(G285:G292)>L293),0,((SUM(G285:G292)/L293)*100)),IF(U283=2,IF(OR(G285>100,G286>100,G287>100,G288>100,G289>100,G290>100,G291>100,G292>100,SUM(G285:G292)>100),0,SUM(G285:G292)))))))","v":0},"Samlet volum for aktuelle elementer:",null,null,null,null,null,null,null,null,1,{"$f":"1","v":1}]
[null,null,{"$f":"IF(G293=0,\"0\",IF(U283=2,\"0\",IF(U283=1,(G293/100)*100,IF(U283=2,(G293/100)*100))))","v":"0"},{"$f":"G293","v":0},null,"Total",{"$f":"IF(SUM(G285:G292)=0,\"1\",SUM(G285:G292))","v":"1"},{"$f":"SUM(H285:H292)","v":0},{"$f":"SUM(I285:I292)","v":0},{"$f":"SUM(J285:J292)","v":0},{"$f":"SUM(K285:K292)","v":0},{"$f":"SUM(L285:L292)","v":0},null,{"$f":"SUM(H295:L295)","v":0},{"$f":"IF(G293<80,\"0,00\",IF(P294>0,\"0\",IF(G293>100,\"0,00\",IF(N285>=80,M285,IF(N285<80,0)))))","v":"0,00"},{"$f":"P285+P286+P287+P288+P289+P290+P291+P292","v":0},{"$f":"1","v":1},{"$f":"1","v":1}]
[null,null,null,null,null,null,"Percentage",{"$f":"IF(H294+G294=0,\"0\",(H294/G294)*100)","v":0},{"$f":"IF(I294+G294=0,\"0\",(I294/G294)*100)","v":0},{"$f":"IF(J294+G294=0,\"0\",(J294/G294)*100)","v":0},{"$f":"IF(K294+G294=0,\"0\",(K294/G294)*100)","v":0},{"$f":"IF(L294+G294=0,\"0\",(L294/G294)*100)","v":0},null,100,null,null,{"$f":"1","v":1},{"$f":"1","v":1}]
[null,null,null,null,null,{"$f":"IF(U283=1,((G294/100)*80))","v":false},"% of 80",{"$f":"(H295/80)*100","v":0},{"$f":"(I295/80)*100","v":0},{"$f":"(J295/80)*100","v":0},{"$f":"(K295/80)*100","v":0},{"$f":"(L295/80)*100","v":0},null,null,null,null,{"$f":"1","v":1},{"$f":"1","v":1}]
[null,null,null,null,null,null,"Limiter",{"$f":"IF(H296>100,\"100\",H296)","v":0},{"$f":"IF(I296>100,\"100\",I296)","v":0},{"$f":"IF(J296>100,\"100\",J296)","v":0},{"$f":"IF(K296>100,\"100\",K296)","v":0},{"$f":"IF(L296>100,\"100\",L296)","v":0},null,null,null,null,{"$f":"1","v":1},{"$f":"1","v":1}]
[null,null,null,null,null,null,null,null,{"$f":"IF(H297+I297+J297+K297+L297=0,0,100-(H297))","v":0},{"$f":"IF(H297+I297+J297+K297+L297=0,0,100-(H297+I297))","v":0},{"$f":"IF(J297+I297+H297+K297+L297=0,0,100-(J297+I297+H297))","v":0},{"$f":"IF(K297+J297+I297+H297+L297=0,0,100-(H297+I297+K297+J297))","v":0},null,null,null,null,{"$f":"1","v":1},{"$f":"1","v":1}]
[null,null,null,null,null,null,null,null,{"$f":"IF(I297>I298,I298,I297)","v":0},{"$f":"IF(J297>J298,J298,J297)","v":0},{"$f":"IF(K297>K298,K298,K297)","v":0},{"$f":"IF(L297>L298,L298,L297)","v":0},null,null,null,null,{"$f":"1","v":1},{"$f":"1","v":1}]
[null,null,null,null,null,null,null,null,null,null,null,{"$f":"IF(K299+J297+H297+I297>=100,0,L299)","v":0},null,null,null,null,{"$f":"1","v":1},{"$f":"1","v":1}]
[null,null,null,null,null,null,"Scores",{"$f":"IF(H294=0,0,0.01*(H297*H302))","v":0},{"$f":"IF(I294=0,0,0.01*(I299*I302))","v":0},{"$f":"IF(J294=0,0,0.01*(J299*J302))","v":0},{"$f":"IF(K294=0,0,0.01*(K299*K302))","v":0},{"$f":"IF(L294=0,0,0.01*(L300*L302))","v":0},null,null,null,null,{"$f":"1","v":1},{"$f":"1","v":1}]
[null,null,null,null,null,null,null,3,2.5,2,1.5,1,null,null,null,null,{"$f":"1","v":1},{"$f":"1","v":1}]
[null,null,"YTTERTAK (3)",null,null,"Velg datatype:",null,null,null,null,null,null,null,null,null,null,{"$f":"IF(freq4>=5,0,1)","v":1},{"$f":"1","v":1},null,null,{"$f":"IF(G303=\"\",2,IF(ISERROR(VLOOKUP(G303,$T$1246:$U$1247,2,FALSE)),\"\",VLOOKUP(G303,$T$1246:$U$1247,2,FALSE)))","v":2}]
[null,null,null,{"$f":"IF(AND(P314>=1,type1=1),\"NB! Volum av nivåene kan ikke være større enn det totale volumet for hvert enkelt materiale!\",+IF(AND(P314>=1,type1=2),\"NB! Prosentandel for hvert nivå må registreres i prosent av det vurderte bygningselementet, og den totale prosentandelen kan ikke være større enn den totale prosent av hvert enkelt materiale!\",\"\"))","v":""},null,null,null,null,null,null,null,null,null,null,null,null,1,{"$f":"1","v":1}]
[null,null,{"$f":"IF(G303=\"\",\"\",IF(SUM(G305:G312)=0,\"\",IF(U303=1,IF(U303+L313=1,\"REGISTRER DET TOTALE VOLUMET AV RELEVANTE MATERIALER\",IF((U303+G313+L313)=1,\"REGISTRER DET TOTALE VOLUMET AV RELEVANTE MATERIALER\",IF(ISERROR(C314),\"REGISTRER DET TOTALE VOLUMET AV RELEVANTE MATERIALER\",IF(OR(G305>L313,G306>L313,G307>L313,G308>L313,G309>L313,G310>L313,G311>L313,G312>L313),\"Volumet av de enkelte materialer kan ikke overstige mengden relevante materialer\",IF(SUM(G305:G312)>L313,\"Den totale mengden av materialer kan ikke overstige det  totale volumet av relevante materialer\",\"\"))))),IF(U303=2,IF(SUM(G305:G312)<80,\"Minst 80 % av de relevante materialer må vurderes, vennligst beregn på nytt.\",IF(OR(G305>100,G306>100,G307>100,G308>100,G309>100,G310>100,G311>100,G312>100),\"Prosentandel av de enkelte materialerer kan ikke overstige 100\",IF(SUM(G305:G312)>100,\"Den totale prosentandelen av materialer kan ikke overstige 100\",\"\")))))))","v":""},null,"Mat. 1",null,null,null,null,null,null,null,{"$f":"IF(SUM(H321+I321+J321+K321+L321)>=3,\"3,00\",SUM(H321+I321+J321+K321+L321))","v":0},{"$f":"IF(AND(U307=1,L313=\"\"),0,IF(OR(NOT(D304=\"\"),NOT(C305=\"\"),NOT(N306=\"\")),0,IF(ISERROR(N314),\"0\",N314)))","v":0},null,{"$f":"IF(SUM(H305:L305)>G305,\"1\",\"0\")","v":"0"},1,{"$f":"1","v":1}]
[null,null,null,null,"Mat. 2",null,null,null,null,null,null,null,null,{"$f":"IF(AND(U303=1,L313=\"\"),C305,+IF(G314>L313,C305,(IF(N314<80,\"Ingen poeng oppnådd,\nmindre enn 80 % oppfyller kravet\",\"\"))))","v":""},null,{"$f":"IF(SUM(H306:L306)>G306,\"1\",\"0\")","v":"0"},1,{"$f":"1","v":1}]
[null,null,null,null,"Mat. 3",null,null,null,null,null,null,null,null,null,null,"0",1,{"$f":"1","v":1}]
[null,null,null,null,"Mat. 4",null,null,null,null,null,null,null,null,null,null,"0",1,{"$f":"1","v":1}]
[null,null,null,null,"Mat. 5",null,null,null,null,null,null,null,null,null,null,"0",1,{"$f":"1","v":1}]
[null,null,null,null,"Mat. 6",null,null,null,null,null,null,null,null,null,null,"0",1,{"$f":"1","v":1}]
[null,null,null,null,"Mat. 7",null,null,null,null,null,null,null,null,null,null,"0",1,{"$f":"1","v":1}]
[null,null,null,null,"Mat. 8",null,null,null,null,null,null,null,null,null,null,"0",1,{"$f":"1","v":1}]
[null,null,null,null,"Totalt % av bygningselementet (relevante materialer) vurdert:",null,{"$f":"IF(U303=\"\",0,IF(U303+L313=1,0,IF(SUM(G305:G312)=0,0,IF(U303=1,IF(OR(G305>L313,G306>L313,G307>L313,G308>L313,G309>L313,G310>L313,G311>L313,G312>L313,SUM(G305:G312)>L313),0,((SUM(G305:G312)/L313)*100)),IF(U303=2,IF(OR(G305>100,G306>100,G307>100,G308>100,G309>100,G310>100,G311>100,G312>100,SUM(G305:G312)>100),0,SUM(G305:G312)))))))","v":0},"Samlet volum for aktuelle elementer:",null,null,null,null,null,null,null,null,1,{"$f":"1","v":1}]
[null,null,{"$f":"IF(G313=0,\"0\",IF(U303=2,\"0\",IF(U303=1,(G313/100)*100,IF(U303=2,(G313/100)*100))))","v":"0"},{"$f":"G313","v":0},null,"Total",{"$f":"IF(SUM(G305:G312)=0,\"1\",SUM(G305:G312))","v":"1"},{"$f":"SUM(H305:H312)","v":0},{"$f":"SUM(I305:I312)","v":0},{"$f":"SUM(J305:J312)","v":0},{"$f":"SUM(K305:K312)","v":0},{"$f":"SUM(L305:L312)","v":0},null,{"$f":"SUM(H315:L315)","v":0},{"$f":"IF(G313<80,\"0,00\",IF(P314>0,\"0\",IF(G313>100,\"0,00\",IF(N305>=80,M305,IF(N305<80,0)))))","v":"0,00"},{"$f":"P305+P306+P307+P308+P309+P310+P311+P312","v":0},{"$f":"1","v":1},{"$f":"1","v":1}]
[null,null,null,null,null,null,"Percentage",{"$f":"IF(H314+G314=0,\"0\",(H314/G314)*100)","v":0},{"$f":"IF(I314+G314=0,\"0\",(I314/G314)*100)","v":0},{"$f":"IF(J314+G314=0,\"0\",(J314/G314)*100)","v":0},{"$f":"IF(K314+G314=0,\"0\",(K314/G314)*100)","v":0},{"$f":"IF(L314+G314=0,\"0\",(L314/G314)*100)","v":0},null,100,null,null,{"$f":"1","v":1},{"$f":"1","v":1}]
[null,null,null,null,null,{"$f":"IF(U303=1,((G314/100)*80))","v":false},"% of 80",{"$f":"(H315/80)*100","v":0},{"$f":"(I315/80)*100","v":0},{"$f":"(J315/80)*100","v":0},{"$f":"(K315/80)*100","v":0},{"$f":"(L315/80)*100","v":0},null,null,null,null,{"$f":"1","v":1},{"$f":"1","v":1}]
[null,null,null,null,null,null,"Limiter",{"$f":"IF(H316>100,\"100\",H316)","v":0},{"$f":"IF(I316>100,\"100\",I316)","v":0},{"$f":"IF(J316>100,\"100\",J316)","v":0},{"$f":"IF(K316>100,\"100\",K316)","v":0},{"$f":"IF(L316>100,\"100\",L316)","v":0},null,null,null,null,{"$f":"1","v":1},{"$f":"1","v":1}]
[null,null,null,null,null,null,null,null,{"$f":"IF(H317+I317+J317+K317+L317=0,0,100-(H317))","v":0},{"$f":"IF(H317+I317+J317+K317+L317=0,0,100-(H317+I317))","v":0},{"$f":"IF(J317+I317+H317+K317+L317=0,0,100-(J317+I317+H317))","v":0},{"$f":"IF(K317+J317+I317+H317+L317=0,0,100-(H317+I317+K317+J317))","v":0},null,null,null,null,{"$f":"1","v":1},{"$f":"1","v":1}]
[null,null,null,null,null,null,null,null,{"$f":"IF(I317>I318,I318,I317)","v":0},{"$f":"IF(J317>J318,J318,J317)","v":0},{"$f":"IF(K317>K318,K318,K317)","v":0},{"$f":"IF(L317>L318,L318,L317)","v":0},null,null,null,null,{"$f":"1","v":1},{"$f":"1","v":1}]
[null,null,null,null,null,null,null,null,null,null,null,{"$f":"IF(K319+J317+H317+I317>=100,0,L319)","v":0},null,null,null,null,{"$f":"1","v":1},{"$f":"1","v":1}]
[null,null,null,null,null,null,"Scores",{"$f":"IF(H314=0,0,0.01*(H317*H322))","v":0},{"$f":"IF(I314=0,0,0.01*(I319*I322))","v":0},{"$f":"IF(J314=0,0,0.01*(J319*J322))","v":0},{"$f":"IF(K314=0,0,0.01*(K319*K322))","v":0},{"$f":"IF(L314=0,0,0.01*(L320*L322))","v":0},null,null,null,null,{"$f":"1","v":1},{"$f":"1","v":1}]
[null,null,null,null,null,null,null,3,2.5,2,1.5,1,null,null,null,null,{"$f":"1","v":1},{"$f":"1","v":1}]
[null,null,"YTTERTAK (4)",null,null,"Velg datatype:",null,null,null,null,null,null,null,null,null,null,{"$f":"IF(freq4>=6,0,1)","v":1},{"$f":"1","v":1},null,null,{"$f":"IF(G323=\"\",2,IF(ISERROR(VLOOKUP(G323,$T$1246:$U$1247,2,FALSE)),\"\",VLOOKUP(G323,$T$1246:$U$1247,2,FALSE)))","v":2}]
[null,null,null,{"$f":"IF(AND(P334>=1,type1=1),\"NB! Volum av nivåene kan ikke være større enn det totale volumet for hvert enkelt materiale!\",+IF(AND(P334>=1,type1=2),\"NB! Prosentandel for hvert nivå må registreres i prosent av det vurderte bygningselementet, og den totale prosentandelen kan ikke være større enn den totale prosent av hvert enkelt materiale!\",\"\"))","v":""},null,null,null,null,null,null,null,null,null,null,null,null,1,{"$f":"1","v":1}]
[null,null,{"$f":"IF(G323=\"\",\"\",IF(SUM(G325:G332)=0,\"\",IF(U323=1,IF(U323+L333=1,\"REGISTRER DET TOTALE VOLUMET AV RELEVANTE MATERIALER\",IF((U323+G333+L333)=1,\"REGISTRER DET TOTALE VOLUMET AV RELEVANTE MATERIALER\",IF(ISERROR(C334),\"REGISTRER DET TOTALE VOLUMET AV RELEVANTE MATERIALER\",IF(OR(G325>L333,G326>L333,G327>L333,G328>L333,G329>L333,G330>L333,G331>L333,G332>L333),\"Volumet av de enkelte materialer kan ikke overstige mengden relevante materialer\",IF(SUM(G325:G332)>L333,\"Den totale mengden av materialer kan ikke overstige det  totale volumet av relevante materialer\",\"\"))))),IF(U323=2,IF(SUM(G325:G332)<80,\"Minst 80 % av de relevante materialer må vurderes, vennligst beregn på nytt.\",IF(OR(G325>100,G326>100,G327>100,G328>100,G329>100,G330>100,G331>100,G332>100),\"Prosentandel av de enkelte materialerer kan ikke overstige 100\",IF(SUM(G325:G332)>100,\"Den totale prosentandelen av materialer kan ikke overstige 100\",\"\")))))))","v":""},null,"Mat. 1",null,null,null,null,null,null,null,{"$f":"IF(SUM(H341+I341+J341+K341+L341)>=3,\"3,00\",SUM(H341+I341+J341+K341+L341))","v":0},{"$f":"IF(AND(U327=1,L333=\"\"),0,IF(OR(NOT(D324=\"\"),NOT(C325=\"\"),NOT(N326=\"\")),0,IF(ISERROR(N334),\"0\",N334)))","v":0},null,{"$f":"IF(SUM(H325:L325)>G325,\"1\",\"0\")","v":"0"},1,{"$f":"1","v":1}]
[null,null,null,null,"Mat. 2",null,null,null,null,null,null,null,null,{"$f":"IF(AND(U323=1,L333=\"\"),C325,+IF(G334>L333,C325,(IF(N334<80,\"Ingen poeng oppnådd,\nmindre enn 80 % oppfyller kravet\",\"\"))))","v":""},null,{"$f":"IF(SUM(H326:L326)>G326,\"1\",\"0\")","v":"0"},1,{"$f":"1","v":1}]
[null,null,null,null,"Mat. 3",null,null,null,null,null,null,null,null,null,null,"0",1,{"$f":"1","v":1}]
[null,null,null,null,"Mat. 4",null,null,null,null,null,null,null,null,null,null,"0",1,{"$f":"1","v":1}]
[null,null,null,null,"Mat. 5",null,null,null,null,null,null,null,null,null,null,"0",1,{"$f":"1","v":1}]
[null,null,null,null,"Mat. 6",null,null,null,null,null,null,null,null,null,null,"0",1,{"$f":"1","v":1}]
[null,null,null,null,"Mat. 7",null,null,null,null,null,null,null,null,null,null,"0",1,{"$f":"1","v":1}]
[null,null,null,null,"Mat. 8",null,null,null,null,null,null,null,null,null,null,"0",1,{"$f":"1","v":1}]
[null,null,null,null,"Totalt % av bygningselementet (relevante materialer) vurdert:",null,{"$f":"IF(U323=\"\",0,IF(U323+L333=1,0,IF(SUM(G325:G332)=0,0,IF(U323=1,IF(OR(G325>L333,G326>L333,G327>L333,G328>L333,G329>L333,G330>L333,G331>L333,G332>L333,SUM(G325:G332)>L333),0,((SUM(G325:G332)/L333)*100)),IF(U323=2,IF(OR(G325>100,G326>100,G327>100,G328>100,G329>100,G330>100,G331>100,G332>100,SUM(G325:G332)>100),0,SUM(G325:G332)))))))","v":0},"Samlet volum for aktuelle elementer:",null,null,null,null,null,null,null,null,1,{"$f":"1","v":1}]
[null,null,{"$f":"IF(G333=0,\"0\",IF(U323=2,\"0\",IF(U323=1,(G333/100)*100,IF(U323=2,(G333/100)*100))))","v":"0"},{"$f":"G333","v":0},null,"Total",{"$f":"IF(SUM(G325:G332)=0,\"1\",SUM(G325:G332))","v":"1"},{"$f":"SUM(H325:H332)","v":0},{"$f":"SUM(I325:I332)","v":0},{"$f":"SUM(J325:J332)","v":0},{"$f":"SUM(K325:K332)","v":0},{"$f":"SUM(L325:L332)","v":0},null,{"$f":"SUM(H335:L335)","v":0},{"$f":"IF(G333<80,\"0,00\",IF(P334>0,\"0\",IF(G333>100,\"0,00\",IF(N325>=80,M325,IF(N325<80,0)))))","v":"0,00"},{"$f":"P325+P326+P327+P328+P329+P330+P331+P332","v":0},{"$f":"1","v":1},{"$f":"1","v":1}]
[null,null,null,null,null,null,"Percentage",{"$f":"IF(H334+G334=0,\"0\",(H334/G334)*100)","v":0},{"$f":"IF(I334+G334=0,\"0\",(I334/G334)*100)","v":0},{"$f":"IF(J334+G334=0,\"0\",(J334/G334)*100)","v":0},{"$f":"IF(K334+G334=0,\"0\",(K334/G334)*100)","v":0},{"$f":"IF(L334+G334=0,\"0\",(L334/G334)*100)","v":0},null,100,null,null,{"$f":"1","v":1},{"$f":"1","v":1}]
[null,null,null,null,null,{"$f":"IF(U323=1,((G334/100)*80))","v":false},"% of 80",{"$f":"(H335/80)*100","v":0},{"$f":"(I335/80)*100","v":0},{"$f":"(J335/80)*100","v":0},{"$f":"(K335/80)*100","v":0},{"$f":"(L335/80)*100","v":0},null,null,null,null,{"$f":"1","v":1},{"$f":"1","v":1}]
[null,null,null,null,null,null,"Limiter",{"$f":"IF(H336>100,\"100\",H336)","v":0},{"$f":"IF(I336>100,\"100\",I336)","v":0},{"$f":"IF(J336>100,\"100\",J336)","v":0},{"$f":"IF(K336>100,\"100\",K336)","v":0},{"$f":"IF(L336>100,\"100\",L336)","v":0},null,null,null,null,{"$f":"1","v":1},{"$f":"1","v":1}]
[null,null,null,null,null,null,null,null,{"$f":"IF(H337+I337+J337+K337+L337=0,0,100-(H337))","v":0},{"$f":"IF(H337+I337+J337+K337+L337=0,0,100-(H337+I337))","v":0},{"$f":"IF(J337+I337+H337+K337+L337=0,0,100-(J337+I337+H337))","v":0},{"$f":"IF(K337+J337+I337+H337+L337=0,0,100-(H337+I337+K337+J337))","v":0},null,null,null,null,{"$f":"1","v":1},{"$f":"1","v":1}]
[null,null,null,null,null,null,null,null,{"$f":"IF(I337>I338,I338,I337)","v":0},{"$f":"IF(J337>J338,J338,J337)","v":0},{"$f":"IF(K337>K338,K338,K337)","v":0},{"$f":"IF(L337>L338,L338,L337)","v":0},null,null,null,null,{"$f":"1","v":1},{"$f":"1","v":1}]
[null,null,null,null,null,null,null,null,null,null,null,{"$f":"IF(K339+J337+H337+I337>=100,0,L339)","v":0},null,null,null,null,{"$f":"1","v":1},{"$f":"1","v":1}]
[null,null,null,null,null,null,"Scores",{"$f":"IF(H334=0,0,0.01*(H337*H342))","v":0},{"$f":"IF(I334=0,0,0.01*(I339*I342))","v":0},{"$f":"IF(J334=0,0,0.01*(J339*J342))","v":0},{"$f":"IF(K334=0,0,0.01*(K339*K342))","v":0},{"$f":"IF(L334=0,0,0.01*(L340*L342))","v":0},null,null,null,null,{"$f":"1","v":1},{"$f":"1","v":1}]
[null,null,null,null,null,null,null,3,2.5,2,1.5,1,null,null,null,null,{"$f":"1","v":1},{"$f":"1","v":1}]
[null,null,"YTTERVEGGER",null,null,"Velg antall yttervegger du ønsker å vurdere (deretter trykk «velg»):",null,null,null,null,{"$f":"IF(AND(G343=\"\",G354>0),\"NB! Husk å velge antall elementer...\",\"\")","v":""},null,null,null,{"$f":"IF(ISERROR(O355+O375+O395+O415)/V344,\"\",(O355+O375+O395+O415)/V344)","v":0},null,{"$f":"0","v":0},{"$f":"IF(asstype=2,0,1)","v":1},null,{"$f":"VLOOKUP(G343,$T$1239:$U$1243,2,FALSE)","v":2}]
[null,null,{"$f":"IF(G343=\"\",\"YTTERVEGGER\",\"YTTERVEGGER (1)\")","v":"YTTERVEGGER"},null,null,"Velg datatype:",null,null,null,null,null,null,null,null,null,null,{"$f":"IF(freq5>=3,0,1)","v":1},1,null,null,{"$f":"IF(G344=\"\",2,IF(ISERROR(VLOOKUP(G344,$T$1246:$U$1247,2,FALSE)),\"\",VLOOKUP(G344,$T$1246:$U$1247,2,FALSE)))","v":2},{"$f":"IF(freq5=3,1,IF(freq5=4,2,IF(freq5=5,3,IF(freq5=6,4,1))))","v":1}]
[null,null,null,{"$f":"IF(AND(P355>=1,type1=1),\"NB! Volum av nivåene kan ikke være større enn det totale volumet for hvert enkelt materiale!\",+IF(AND(P355>=1,type1=2),\"NB! Prosentandel for hvert nivå må registreres i prosent av det vurderte bygningselementet, og den totale prosentandelen kan ikke være større enn den totale prosent av hvert enkelt materiale!\",\"\"))","v":""},null,null,null,null,null,null,null,null,null,null,null,null,1,1]
[null,null,{"$f":"IF(G344=\"\",\"\",IF(SUM(G346:G353)=0,\"\",IF(U344=1,IF(U344+L354=1,\"REGISTRER DET TOTALE VOLUMET AV RELEVANTE MATERIALER\",IF((U344+G354+L354)=1,\"REGISTRER DET TOTALE VOLUMET AV RELEVANTE MATERIALER\",IF(ISERROR(C355),\"REGISTRER DET TOTALE VOLUMET AV RELEVANTE MATERIALER\",IF(OR(G346>L354,G347>L354,G348>L354,G349>L354,G350>L354,G351>L354,G352>L354,G353>L354),\"Volumet av de enkelte materialer kan ikke overstige mengden relevante materialer\",IF(SUM(G346:G353)>L354,\"Den totale mengden av materialer kan ikke overstige det  totale volumet av relevante materialer\",\"\"))))),IF(U344=2,IF(SUM(G346:G353)<80,\"Minst 80 % av de relevante materialer må vurderes, vennligst beregn på nytt.\",IF(OR(G346>100,G347>100,G348>100,G349>100,G350>100,G351>100,G352>100,G353>100),\"Prosentandel av de enkelte materialerer kan ikke overstige 100\",IF(SUM(G346:G353)>100,\"Den totale prosentandelen av materialer kan ikke overstige 100\",\"\")))))))","v":""},null,"Mat. 1",null,null,null,null,null,null,null,{"$f":"IF(SUM(H362+I362+J362+K362+L362)>=3,\"3,00\",SUM(H362+I362+J362+K362+L362))","v":0},{"$f":"IF(AND(U344=1,L354=\"\"),0,IF(OR(NOT(D345=\"\"),NOT(C346=\"\"),NOT(N347=\"\")),0,IF(ISERROR(N355),\"0\",N355)))","v":0},null,{"$f":"IF(SUM(H346:L346)>G346,\"1\",\"0\")","v":"0"},1,1]
[null,null,null,null,"Mat. 2",null,null,null,null,null,null,null,null,{"$f":"IF(AND(U344=1,L354=\"\"),C346,+IF(G355>L354,C346,(IF(N355<80,\"Ingen poeng oppnådd,\nmindre enn 80 % oppfyller kravet\",\"\"))))","v":""},null,{"$f":"IF(SUM(H347:L347)>G347,\"1\",\"0\")","v":"0"},1,1]
[null,null,null,null,"Mat. 3",null,null,null,null,null,null,null,null,null,null,"0",1,1]
[null,null,null,null,"Mat. 4",null,null,null,null,null,null,null,null,null,null,"0",1,1]
[null,null,null,null,"Mat. 5",null,null,null,null,null,null,null,null,null,null,"0",1,1]
[null,null,null,null,"Mat. 6",null,null,null,null,null,null,null,null,null,null,"0",1,1]
[null,null,null,null,"Mat. 7",null,null,null,null,null,null,null,null,null,null,"0",1,1]
[null,null,null,null,"Mat. 8",null,null,null,null,null,null,null,null,null,null,"0",1,1]
[null,null,null,null,"Totalt % av bygningselementet (relevante materialer) vurdert:",null,{"$f":"IF(U344=\"\",0,IF(U344+L354=1,0,IF(SUM(G346:G353)=0,0,IF(U344=1,IF(OR(G346>L354,G347>L354,G348>L354,G349>L354,G350>L354,G351>L354,G352>L354,G353>L354,SUM(G346:G353)>L354),0,((SUM(G346:G353)/L354)*100)),IF(U344=2,IF(OR(G346>100,G347>100,G348>100,G349>100,G350>100,G351>100,G352>100,G353>100,SUM(G346:G353)>100),0,SUM(G346:G353)))))))","v":0},"Samlet volum for aktuelle elementer:",null,null,null,null,null,null,null,null,1,1]
[null,null,{"$f":"IF(G354=0,\"0\",IF(U344=2,\"0\",IF(U344=1,(G354/100)*100,IF(U344=2,(G354/100)*100))))","v":"0"},{"$f":"G354","v":0},null,"Total",{"$f":"IF(SUM(G346:G353)=0,\"1\",SUM(G346:G353))","v":"1"},{"$f":"SUM(H346:H353)","v":0},{"$f":"SUM(I346:I353)","v":0},{"$f":"SUM(J346:J353)","v":0},{"$f":"SUM(K346:K353)","v":0},{"$f":"SUM(L346:L353)","v":0},null,{"$f":"SUM(H356:L356)","v":0},{"$f":"IF(G354<80,\"0,00\",IF(P355>0,\"0\",IF(G354>100,\"0,00\",IF(N346>=80,M346,IF(N346<80,0)))))","v":"0,00"},{"$f":"P346+P347+P348+P349+P350+P351+P352+P353","v":0},{"$f":"1","v":1},{"$f":"1","v":1}]
[null,null,null,null,null,null,"Percentage",{"$f":"IF(H355+G355=0,\"0\",(H355/G355)*100)","v":0},{"$f":"IF(I355+G355=0,\"0\",(I355/G355)*100)","v":0},{"$f":"IF(J355+G355=0,\"0\",(J355/G355)*100)","v":0},{"$f":"IF(K355+G355=0,\"0\",(K355/G355)*100)","v":0},{"$f":"IF(L355+G355=0,\"0\",(L355/G355)*100)","v":0},null,100,null,null,{"$f":"1","v":1},{"$f":"1","v":1}]
[null,null,null,null,null,{"$f":"IF(U344=1,((G355/100)*80))","v":false},"% of 80",{"$f":"(H356/80)*100","v":0},{"$f":"(I356/80)*100","v":0},{"$f":"(J356/80)*100","v":0},{"$f":"(K356/80)*100","v":0},{"$f":"(L356/80)*100","v":0},null,null,null,null,{"$f":"1","v":1},{"$f":"1","v":1}]
[null,null,null,null,null,null,"Limiter",{"$f":"IF(H357>100,\"100\",H357)","v":0},{"$f":"IF(I357>100,\"100\",I357)","v":0},{"$f":"IF(J357>100,\"100\",J357)","v":0},{"$f":"IF(K357>100,\"100\",K357)","v":0},{"$f":"IF(L357>100,\"100\",L357)","v":0},null,null,null,null,{"$f":"1","v":1},{"$f":"1","v":1}]
[null,null,null,null,null,null,null,null,{"$f":"IF(H358+I358+J358+K358+L358=0,0,100-(H358))","v":0},{"$f":"IF(H358+I358+J358+K358+L358=0,0,100-(H358+I358))","v":0},{"$f":"IF(J358+I358+H358+K358+L358=0,0,100-(J358+I358+H358))","v":0},{"$f":"IF(K358+J358+I358+H358+L358=0,0,100-(H358+I358+K358+J358))","v":0},null,null,null,null,{"$f":"1","v":1},{"$f":"1","v":1}]
[null,null,null,null,null,null,null,null,{"$f":"IF(I358>I359,I359,I358)","v":0},{"$f":"IF(J358>J359,J359,J358)","v":0},{"$f":"IF(K358>K359,K359,K358)","v":0},{"$f":"IF(L358>L359,L359,L358)","v":0},null,null,null,null,{"$f":"1","v":1},{"$f":"1","v":1}]
[null,null,null,null,null,null,null,null,null,null,null,{"$f":"IF(K360+J358+H358+I358>=100,0,L360)","v":0},null,null,null,null,{"$f":"1","v":1},{"$f":"1","v":1}]
[null,null,null,null,null,null,"Scores",{"$f":"IF(H355=0,0,0.01*(H358*H363))","v":0},{"$f":"IF(I355=0,0,0.01*(I360*I363))","v":0},{"$f":"IF(J355=0,0,0.01*(J360*J363))","v":0},{"$f":"IF(K355=0,0,0.01*(K360*K363))","v":0},{"$f":"IF(L355=0,0,0.01*(L361*L363))","v":0},null,null,null,null,{"$f":"1","v":1},{"$f":"1","v":1}]
[null,null,null,null,null,null,null,3,2.5,2,1.5,1,null,null,null,null,{"$f":"1","v":1},{"$f":"1","v":1}]
[null,null,"YTTERVEGGER (2)",null,null,"Velg datatype:",null,null,null,null,null,null,null,null,null,null,{"$f":"IF(freq5>=4,0,1)","v":1},{"$f":"1","v":1},null,null,{"$f":"IF(G364=\"\",2,IF(ISERROR(VLOOKUP(G364,$T$1246:$U$1247,2,FALSE)),\"\",VLOOKUP(G364,$T$1246:$U$1247,2,FALSE)))","v":2}]
[null,null,null,{"$f":"IF(AND(P375>=1,type1=1),\"NB! Volum av nivåene kan ikke være større enn det totale volumet for hvert enkelt materiale!\",+IF(AND(P375>=1,type1=2),\"NB! Prosentandel for hvert nivå må registreres i prosent av det vurderte bygningselementet, og den totale prosentandelen kan ikke være større enn den totale prosent av hvert enkelt materiale!\",\"\"))","v":""},null,null,null,null,null,null,null,null,null,null,null,null,1,{"$f":"1","v":1}]
[null,null,{"$f":"IF(G364=\"\",\"\",IF(SUM(G366:G373)=0,\"\",IF(U364=1,IF(U364+L374=1,\"REGISTRER DET TOTALE VOLUMET AV RELEVANTE MATERIALER\",IF((U364+G374+L374)=1,\"REGISTRER DET TOTALE VOLUMET AV RELEVANTE MATERIALER\",IF(ISERROR(C375),\"REGISTRER DET TOTALE VOLUMET AV RELEVANTE MATERIALER\",IF(OR(G366>L374,G367>L374,G368>L374,G369>L374,G370>L374,G371>L374,G372>L374,G373>L374),\"Volumet av de enkelte materialer kan ikke overstige mengden relevante materialer\",IF(SUM(G366:G373)>L374,\"Den totale mengden av materialer kan ikke overstige det  totale volumet av relevante materialer\",\"\"))))),IF(U364=2,IF(SUM(G366:G373)<80,\"Minst 80 % av de relevante materialer må vurderes, vennligst beregn på nytt.\",IF(OR(G366>100,G367>100,G368>100,G369>100,G370>100,G371>100,G372>100,G373>100),\"Prosentandel av de enkelte materialerer kan ikke overstige 100\",IF(SUM(G366:G373)>100,\"Den totale prosentandelen av materialer kan ikke overstige 100\",\"\")))))))","v":""},null,"Mat. 1",null,null,null,null,null,null,null,{"$f":"IF(SUM(H382+I382+J382+K382+L382)>=3,\"3,00\",SUM(H382+I382+J382+K382+L382))","v":0},{"$f":"IF(AND(U368=1,L374=\"\"),0,IF(OR(NOT(D365=\"\"),NOT(C366=\"\"),NOT(N367=\"\")),0,IF(ISERROR(N375),\"0\",N375)))","v":0},null,{"$f":"IF(SUM(H366:L366)>G366,\"1\",\"0\")","v":"0"},1,{"$f":"1","v":1}]
[null,null,null,null,"Mat. 2",null,null,null,null,null,null,null,null,{"$f":"IF(AND(U364=1,L374=\"\"),C366,+IF(G375>L374,C366,(IF(N375<80,\"Ingen poeng oppnådd,\nmindre enn 80 % oppfyller kravet\",\"\"))))","v":""},null,{"$f":"IF(SUM(H367:L367)>G367,\"1\",\"0\")","v":"0"},1,{"$f":"1","v":1}]
[null,null,null,null,"Mat. 3",null,null,null,null,null,null,null,null,null,null,"0",1,{"$f":"1","v":1}]
[null,null,null,null,"Mat. 4",null,null,null,null,null,null,null,null,null,null,"0",1,{"$f":"1","v":1}]
[null,null,null,null,"Mat. 5",null,null,null,null,null,null,null,null,null,null,"0",1,{"$f":"1","v":1}]
[null,null,null,null,"Mat. 6",null,null,null,null,null,null,null,null,null,null,"0",1,{"$f":"1","v":1}]
[null,null,null,null,"Mat. 7",null,null,null,null,null,null,null,null,null,null,"0",1,{"$f":"1","v":1}]
[null,null,null,null,"Mat. 8",null,null,null,null,null,null,null,null,null,null,"0",1,{"$f":"1","v":1}]
[null,null,null,null,"Totalt % av bygningselementet (relevante materialer) vurdert:",null,{"$f":"IF(U364=\"\",0,IF(U364+L374=1,0,IF(SUM(G366:G373)=0,0,IF(U364=1,IF(OR(G366>L374,G367>L374,G368>L374,G369>L374,G370>L374,G371>L374,G372>L374,G373>L374,SUM(G366:G373)>L374),0,((SUM(G366:G373)/L374)*100)),IF(U364=2,IF(OR(G366>100,G367>100,G368>100,G369>100,G370>100,G371>100,G372>100,G373>100,SUM(G366:G373)>100),0,SUM(G366:G373)))))))","v":0},"Samlet volum for aktuelle elementer:",null,null,null,null,null,null,null,null,1,{"$f":"1","v":1}]
[null,null,{"$f":"IF(G374=0,\"0\",IF(U364=2,\"0\",IF(U364=1,(G374/100)*100,IF(U364=2,(G374/100)*100))))","v":"0"},{"$f":"G374","v":0},null,"Total",{"$f":"IF(SUM(G366:G373)=0,\"1\",SUM(G366:G373))","v":"1"},{"$f":"SUM(H366:H373)","v":0},{"$f":"SUM(I366:I373)","v":0},{"$f":"SUM(J366:J373)","v":0},{"$f":"SUM(K366:K373)","v":0},{"$f":"SUM(L366:L373)","v":0},null,{"$f":"SUM(H376:L376)","v":0},{"$f":"IF(G374<80,\"0,00\",IF(P375>0,\"0\",IF(G374>100,\"0,00\",IF(N366>=80,M366,IF(N366<80,0)))))","v":"0,00"},{"$f":"P366+P367+P368+P369+P370+P371+P372+P373","v":0},{"$f":"1","v":1},{"$f":"1","v":1}]
[null,null,null,null,null,null,"Percentage",{"$f":"IF(H375+G375=0,\"0\",(H375/G375)*100)","v":0},{"$f":"IF(I375+G375=0,\"0\",(I375/G375)*100)","v":0},{"$f":"IF(J375+G375=0,\"0\",(J375/G375)*100)","v":0},{"$f":"IF(K375+G375=0,\"0\",(K375/G375)*100)","v":0},{"$f":"IF(L375+G375=0,\"0\",(L375/G375)*100)","v":0},null,100,null,null,{"$f":"1","v":1},{"$f":"1","v":1}]
[null,null,null,null,null,{"$f":"IF(U364=1,((G375/100)*80))","v":false},"% of 80",{"$f":"(H376/80)*100","v":0},{"$f":"(I376/80)*100","v":0},{"$f":"(J376/80)*100","v":0},{"$f":"(K376/80)*100","v":0},{"$f":"(L376/80)*100","v":0},null,null,null,null,{"$f":"1","v":1},{"$f":"1","v":1}]
[null,null,null,null,null,null,"Limiter",{"$f":"IF(H377>100,\"100\",H377)","v":0},{"$f":"IF(I377>100,\"100\",I377)","v":0},{"$f":"IF(J377>100,\"100\",J377)","v":0},{"$f":"IF(K377>100,\"100\",K377)","v":0},{"$f":"IF(L377>100,\"100\",L377)","v":0},null,null,null,null,{"$f":"1","v":1},{"$f":"1","v":1}]
[null,null,null,null,null,null,null,null,{"$f":"IF(H378+I378+J378+K378+L378=0,0,100-(H378))","v":0},{"$f":"IF(H378+I378+J378+K378+L378=0,0,100-(H378+I378))","v":0},{"$f":"IF(J378+I378+H378+K378+L378=0,0,100-(J378+I378+H378))","v":0},{"$f":"IF(K378+J378+I378+H378+L378=0,0,100-(H378+I378+K378+J378))","v":0},null,null,null,null,{"$f":"1","v":1},{"$f":"1","v":1}]
[null,null,null,null,null,null,null,null,{"$f":"IF(I378>I379,I379,I378)","v":0},{"$f":"IF(J378>J379,J379,J378)","v":0},{"$f":"IF(K378>K379,K379,K378)","v":0},{"$f":"IF(L378>L379,L379,L378)","v":0},null,null,null,null,{"$f":"1","v":1},{"$f":"1","v":1}]
[null,null,null,null,null,null,null,null,null,null,null,{"$f":"IF(K380+J378+H378+I378>=100,0,L380)","v":0},null,null,null,null,{"$f":"1","v":1},{"$f":"1","v":1}]
[null,null,null,null,null,null,"Scores",{"$f":"IF(H375=0,0,0.01*(H378*H383))","v":0},{"$f":"IF(I375=0,0,0.01*(I380*I383))","v":0},{"$f":"IF(J375=0,0,0.01*(J380*J383))","v":0},{"$f":"IF(K375=0,0,0.01*(K380*K383))","v":0},{"$f":"IF(L375=0,0,0.01*(L381*L383))","v":0},null,null,null,null,{"$f":"1","v":1},{"$f":"1","v":1}]
[null,null,null,null,null,null,null,3,2.5,2,1.5,1,null,null,null,null,{"$f":"1","v":1},{"$f":"1","v":1}]
[null,null,"YTTERVEGGER (3)",null,null,"Velg datatype:",null,null,null,null,null,null,null,null,null,null,{"$f":"IF(freq5>=5,0,1)","v":1},{"$f":"1","v":1},null,null,{"$f":"IF(G384=\"\",2,IF(ISERROR(VLOOKUP(G384,$T$1246:$U$1247,2,FALSE)),\"\",VLOOKUP(G384,$T$1246:$U$1247,2,FALSE)))","v":2}]
[null,null,null,{"$f":"IF(AND(P395>=1,type1=1),\"NB! Volum av nivåene kan ikke være større enn det totale volumet for hvert enkelt materiale!\",+IF(AND(P395>=1,type1=2),\"NB! Prosentandel for hvert nivå må registreres i prosent av det vurderte bygningselementet, og den totale prosentandelen kan ikke være større enn den totale prosent av hvert enkelt materiale!\",\"\"))","v":""},null,null,null,null,null,null,null,null,null,null,null,null,1,{"$f":"1","v":1}]
[null,null,{"$f":"IF(G384=\"\",\"\",IF(SUM(G386:G393)=0,\"\",IF(U384=1,IF(U384+L394=1,\"REGISTRER DET TOTALE VOLUMET AV RELEVANTE MATERIALER\",IF((U384+G394+L394)=1,\"REGISTRER DET TOTALE VOLUMET AV RELEVANTE MATERIALER\",IF(ISERROR(C395),\"REGISTRER DET TOTALE VOLUMET AV RELEVANTE MATERIALER\",IF(OR(G386>L394,G387>L394,G388>L394,G389>L394,G390>L394,G391>L394,G392>L394,G393>L394),\"Volumet av de enkelte materialer kan ikke overstige mengden relevante materialer\",IF(SUM(G386:G393)>L394,\"Den totale mengden av materialer kan ikke overstige det  totale volumet av relevante materialer\",\"\"))))),IF(U384=2,IF(SUM(G386:G393)<80,\"Minst 80 % av de relevante materialer må vurderes, vennligst beregn på nytt.\",IF(OR(G386>100,G387>100,G388>100,G389>100,G390>100,G391>100,G392>100,G393>100),\"Prosentandel av de enkelte materialerer kan ikke overstige 100\",IF(SUM(G386:G393)>100,\"Den totale prosentandelen av materialer kan ikke overstige 100\",\"\")))))))","v":""},null,"Mat. 1",null,null,null,null,null,null,null,{"$f":"IF(SUM(H402+I402+J402+K402+L402)>=3,\"3,00\",SUM(H402+I402+J402+K402+L402))","v":0},{"$f":"IF(AND(U388=1,L394=\"\"),0,IF(OR(NOT(D385=\"\"),NOT(C386=\"\"),NOT(N387=\"\")),0,IF(ISERROR(N395),\"0\",N395)))","v":0},null,{"$f":"IF(SUM(H386:L386)>G386,\"1\",\"0\")","v":"0"},1,{"$f":"1","v":1}]
[null,null,null,null,"Mat. 2",null,null,null,null,null,null,null,null,{"$f":"IF(AND(U384=1,L394=\"\"),C386,+IF(G395>L394,C386,(IF(N395<80,\"Ingen poeng oppnådd,\nmindre enn 80 % oppfyller kravet\",\"\"))))","v":""},null,{"$f":"IF(SUM(H387:L387)>G387,\"1\",\"0\")","v":"0"},1,{"$f":"1","v":1}]
[null,null,null,null,"Mat. 3",null,null,null,null,null,null,null,null,null,null,"0",1,{"$f":"1","v":1}]
[null,null,null,null,"Mat. 4",null,null,null,null,null,null,null,null,null,null,"0",1,{"$f":"1","v":1}]
[null,null,null,null,"Mat. 5",null,null,null,null,null,null,null,null,null,null,"0",1,{"$f":"1","v":1}]
[null,null,null,null,"Mat. 6",null,null,null,null,null,null,null,null,null,null,"0",1,{"$f":"1","v":1}]
[null,null,null,null,"Mat. 7",null,null,null,null,null,null,null,null,null,null,"0",1,{"$f":"1","v":1}]
[null,null,null,null,"Mat. 8",null,null,null,null,null,null,null,null,null,null,"0",1,{"$f":"1","v":1}]
[null,null,null,null,"Totalt % av bygningselementet (relevante materialer) vurdert:",null,{"$f":"IF(U384=\"\",0,IF(U384+L394=1,0,IF(SUM(G386:G393)=0,0,IF(U384=1,IF(OR(G386>L394,G387>L394,G388>L394,G389>L394,G390>L394,G391>L394,G392>L394,G393>L394,SUM(G386:G393)>L394),0,((SUM(G386:G393)/L394)*100)),IF(U384=2,IF(OR(G386>100,G387>100,G388>100,G389>100,G390>100,G391>100,G392>100,G393>100,SUM(G386:G393)>100),0,SUM(G386:G393)))))))","v":0},"Samlet volum for aktuelle elementer:",null,null,null,null,null,null,null,null,1,{"$f":"1","v":1}]
[null,null,{"$f":"IF(G394=0,\"0\",IF(U384=2,\"0\",IF(U384=1,(G394/100)*100,IF(U384=2,(G394/100)*100))))","v":"0"},{"$f":"G394","v":0},null,"Total",{"$f":"IF(SUM(G386:G393)=0,\"1\",SUM(G386:G393))","v":"1"},{"$f":"SUM(H386:H393)","v":0},{"$f":"SUM(I386:I393)","v":0},{"$f":"SUM(J386:J393)","v":0},{"$f":"SUM(K386:K393)","v":0},{"$f":"SUM(L386:L393)","v":0},null,{"$f":"SUM(H396:L396)","v":0},{"$f":"IF(G394<80,\"0,00\",IF(P395>0,\"0\",IF(G394>100,\"0,00\",IF(N386>=80,M386,IF(N386<80,0)))))","v":"0,00"},{"$f":"P386+P387+P388+P389+P390+P391+P392+P393","v":0},{"$f":"1","v":1},{"$f":"1","v":1}]
[null,null,null,null,null,null,"Percentage",{"$f":"IF(H395+G395=0,\"0\",(H395/G395)*100)","v":0},{"$f":"IF(I395+G395=0,\"0\",(I395/G395)*100)","v":0},{"$f":"IF(J395+G395=0,\"0\",(J395/G395)*100)","v":0},{"$f":"IF(K395+G395=0,\"0\",(K395/G395)*100)","v":0},{"$f":"IF(L395+G395=0,\"0\",(L395/G395)*100)","v":0},null,100,null,null,{"$f":"1","v":1},{"$f":"1","v":1}]
[null,null,null,null,null,{"$f":"IF(U384=1,((G395/100)*80))","v":false},"% of 80",{"$f":"(H396/80)*100","v":0},{"$f":"(I396/80)*100","v":0},{"$f":"(J396/80)*100","v":0},{"$f":"(K396/80)*100","v":0},{"$f":"(L396/80)*100","v":0},null,null,null,null,{"$f":"1","v":1},{"$f":"1","v":1}]
[null,null,null,null,null,null,"Limiter",{"$f":"IF(H397>100,\"100\",H397)","v":0},{"$f":"IF(I397>100,\"100\",I397)","v":0},{"$f":"IF(J397>100,\"100\",J397)","v":0},{"$f":"IF(K397>100,\"100\",K397)","v":0},{"$f":"IF(L397>100,\"100\",L397)","v":0},null,null,null,null,{"$f":"1","v":1},{"$f":"1","v":1}]
[null,null,null,null,null,null,null,null,{"$f":"IF(H398+I398+J398+K398+L398=0,0,100-(H398))","v":0},{"$f":"IF(H398+I398+J398+K398+L398=0,0,100-(H398+I398))","v":0},{"$f":"IF(J398+I398+H398+K398+L398=0,0,100-(J398+I398+H398))","v":0},{"$f":"IF(K398+J398+I398+H398+L398=0,0,100-(H398+I398+K398+J398))","v":0},null,null,null,null,{"$f":"1","v":1},{"$f":"1","v":1}]
[null,null,null,null,null,null,null,null,{"$f":"IF(I398>I399,I399,I398)","v":0},{"$f":"IF(J398>J399,J399,J398)","v":0},{"$f":"IF(K398>K399,K399,K398)","v":0},{"$f":"IF(L398>L399,L399,L398)","v":0},null,null,null,null,{"$f":"1","v":1},{"$f":"1","v":1}]
[null,null,null,null,null,null,null,null,null,null,null,{"$f":"IF(K400+J398+H398+I398>=100,0,L400)","v":0},null,null,null,null,{"$f":"1","v":1},{"$f":"1","v":1}]
[null,null,null,null,null,null,"Scores",{"$f":"IF(H395=0,0,0.01*(H398*H403))","v":0},{"$f":"IF(I395=0,0,0.01*(I400*I403))","v":0},{"$f":"IF(J395=0,0,0.01*(J400*J403))","v":0},{"$f":"IF(K395=0,0,0.01*(K400*K403))","v":0},{"$f":"IF(L395=0,0,0.01*(L401*L403))","v":0},null,null,null,null,{"$f":"1","v":1},{"$f":"1","v":1}]
[null,null,null,null,null,null,null,3,2.5,2,1.5,1,null,null,null,null,{"$f":"1","v":1},{"$f":"1","v":1}]
[null,null,"YTTERVEGGER (4)",null,null,"Velg datatype:",null,null,null,null,null,null,null,null,null,null,{"$f":"IF(freq5>=6,0,1)","v":1},{"$f":"1","v":1},null,null,{"$f":"IF(G404=\"\",2,IF(ISERROR(VLOOKUP(G404,$T$1246:$U$1247,2,FALSE)),\"\",VLOOKUP(G404,$T$1246:$U$1247,2,FALSE)))","v":2}]
[null,null,null,{"$f":"IF(AND(P415>=1,type1=1),\"NB! Volum av nivåene kan ikke være større enn det totale volumet for hvert enkelt materiale!\",+IF(AND(P415>=1,type1=2),\"NB! Prosentandel for hvert nivå må registreres i prosent av det vurderte bygningselementet, og den totale prosentandelen kan ikke være større enn den totale prosent av hvert enkelt materiale!\",\"\"))","v":""},null,null,null,null,null,null,null,null,null,null,null,null,1,{"$f":"1","v":1}]
[null,null,{"$f":"IF(G404=\"\",\"\",IF(SUM(G406:G413)=0,\"\",IF(U404=1,IF(U404+L414=1,\"REGISTRER DET TOTALE VOLUMET AV RELEVANTE MATERIALER\",IF((U404+G414+L414)=1,\"REGISTRER DET TOTALE VOLUMET AV RELEVANTE MATERIALER\",IF(ISERROR(C415),\"REGISTRER DET TOTALE VOLUMET AV RELEVANTE MATERIALER\",IF(OR(G406>L414,G407>L414,G408>L414,G409>L414,G410>L414,G411>L414,G412>L414,G413>L414),\"Volumet av de enkelte materialer kan ikke overstige mengden relevante materialer\",IF(SUM(G406:G413)>L414,\"Den totale mengden av materialer kan ikke overstige det  totale volumet av relevante materialer\",\"\"))))),IF(U404=2,IF(SUM(G406:G413)<80,\"Minst 80 % av de relevante materialer må vurderes, vennligst beregn på nytt.\",IF(OR(G406>100,G407>100,G408>100,G409>100,G410>100,G411>100,G412>100,G413>100),\"Prosentandel av de enkelte materialerer kan ikke overstige 100\",IF(SUM(G406:G413)>100,\"Den totale prosentandelen av materialer kan ikke overstige 100\",\"\")))))))","v":""},null,"Mat. 1",null,null,null,null,null,null,null,{"$f":"IF(SUM(H422+I422+J422+K422+L422)>=3,\"3,00\",SUM(H422+I422+J422+K422+L422))","v":0},{"$f":"IF(AND(U408=1,L414=\"\"),0,IF(OR(NOT(D405=\"\"),NOT(C406=\"\"),NOT(N407=\"\")),0,IF(ISERROR(N415),\"0\",N415)))","v":0},null,{"$f":"IF(SUM(H406:L406)>G406,\"1\",\"0\")","v":"0"},1,{"$f":"1","v":1}]
[null,null,null,null,"Mat. 2",null,null,null,null,null,null,null,null,{"$f":"IF(AND(U404=1,L414=\"\"),C406,+IF(G415>L414,C406,(IF(N415<80,\"Ingen poeng oppnådd,\nmindre enn 80 % oppfyller kravet\",\"\"))))","v":""},null,{"$f":"IF(SUM(H407:L407)>G407,\"1\",\"0\")","v":"0"},1,{"$f":"1","v":1}]
[null,null,null,null,"Mat. 3",null,null,null,null,null,null,null,null,null,null,"0",1,{"$f":"1","v":1}]
[null,null,null,null,"Mat. 4",null,null,null,null,null,null,null,null,null,null,"0",1,{"$f":"1","v":1}]
[null,null,null,null,"Mat. 5",null,null,null,null,null,null,null,null,null,null,"0",1,{"$f":"1","v":1}]
[null,null,null,null,"Mat. 6",null,null,null,null,null,null,null,null,null,null,"0",1,{"$f":"1","v":1}]
[null,null,null,null,"Mat. 7",null,null,null,null,null,null,null,null,null,null,"0",1,{"$f":"1","v":1}]
[null,null,null,null,"Mat. 8",null,null,null,null,null,null,null,null,null,null,"0",1,{"$f":"1","v":1}]
[null,null,null,null,"Totalt % av bygningselementet (relevante materialer) vurdert:",null,{"$f":"IF(U404=\"\",0,IF(U404+L414=1,0,IF(SUM(G406:G413)=0,0,IF(U404=1,IF(OR(G406>L414,G407>L414,G408>L414,G409>L414,G410>L414,G411>L414,G412>L414,G413>L414,SUM(G406:G413)>L414),0,((SUM(G406:G413)/L414)*100)),IF(U404=2,IF(OR(G406>100,G407>100,G408>100,G409>100,G410>100,G411>100,G412>100,G413>100,SUM(G406:G413)>100),0,SUM(G406:G413)))))))","v":0},"Samlet volum for aktuelle elementer:",null,null,null,null,null,null,null,null,1,{"$f":"1","v":1}]
[null,null,{"$f":"IF(G414=0,\"0\",IF(U404=2,\"0\",IF(U404=1,(G414/100)*100,IF(U404=2,(G414/100)*100))))","v":"0"},{"$f":"G414","v":0},null,"Total",{"$f":"IF(SUM(G406:G413)=0,\"1\",SUM(G406:G413))","v":"1"},{"$f":"SUM(H406:H413)","v":0},{"$f":"SUM(I406:I413)","v":0},{"$f":"SUM(J406:J413)","v":0},{"$f":"SUM(K406:K413)","v":0},{"$f":"SUM(L406:L413)","v":0},null,{"$f":"SUM(H416:L416)","v":0},{"$f":"IF(G414<80,\"0,00\",IF(P415>0,\"0\",IF(G414>100,\"0,00\",IF(N406>=80,M406,IF(N406<80,0)))))","v":"0,00"},{"$f":"P406+P407+P408+P409+P410+P411+P412+P413","v":0},{"$f":"1","v":1},{"$f":"1","v":1}]
[null,null,null,null,null,null,"Percentage",{"$f":"IF(H415+G415=0,\"0\",(H415/G415)*100)","v":0},{"$f":"IF(I415+G415=0,\"0\",(I415/G415)*100)","v":0},{"$f":"IF(J415+G415=0,\"0\",(J415/G415)*100)","v":0},{"$f":"IF(K415+G415=0,\"0\",(K415/G415)*100)","v":0},{"$f":"IF(L415+G415=0,\"0\",(L415/G415)*100)","v":0},null,100,null,null,{"$f":"1","v":1},{"$f":"1","v":1}]
[null,null,null,null,null,{"$f":"IF(U404=1,((G415/100)*80))","v":false},"% of 80",{"$f":"(H416/80)*100","v":0},{"$f":"(I416/80)*100","v":0},{"$f":"(J416/80)*100","v":0},{"$f":"(K416/80)*100","v":0},{"$f":"(L416/80)*100","v":0},null,null,null,null,{"$f":"1","v":1},{"$f":"1","v":1}]
[null,null,null,null,null,null,"Limiter",{"$f":"IF(H417>100,\"100\",H417)","v":0},{"$f":"IF(I417>100,\"100\",I417)","v":0},{"$f":"IF(J417>100,\"100\",J417)","v":0},{"$f":"IF(K417>100,\"100\",K417)","v":0},{"$f":"IF(L417>100,\"100\",L417)","v":0},null,null,null,null,{"$f":"1","v":1},{"$f":"1","v":1}]
[null,null,null,null,null,null,null,null,{"$f":"IF(H418+I418+J418+K418+L418=0,0,100-(H418))","v":0},{"$f":"IF(H418+I418+J418+K418+L418=0,0,100-(H418+I418))","v":0},{"$f":"IF(J418+I418+H418+K418+L418=0,0,100-(J418+I418+H418))","v":0},{"$f":"IF(K418+J418+I418+H418+L418=0,0,100-(H418+I418+K418+J418))","v":0},null,null,null,null,{"$f":"1","v":1},{"$f":"1","v":1}]
[null,null,null,null,null,null,null,null,{"$f":"IF(I418>I419,I419,I418)","v":0},{"$f":"IF(J418>J419,J419,J418)","v":0},{"$f":"IF(K418>K419,K419,K418)","v":0},{"$f":"IF(L418>L419,L419,L418)","v":0},null,null,null,null,{"$f":"1","v":1},{"$f":"1","v":1}]
[null,null,null,null,null,null,null,null,null,null,null,{"$f":"IF(K420+J418+H418+I418>=100,0,L420)","v":0},null,null,null,null,{"$f":"1","v":1},{"$f":"1","v":1}]
[null,null,null,null,null,null,"Scores",{"$f":"IF(H415=0,0,0.01*(H418*H423))","v":0},{"$f":"IF(I415=0,0,0.01*(I420*I423))","v":0},{"$f":"IF(J415=0,0,0.01*(J420*J423))","v":0},{"$f":"IF(K415=0,0,0.01*(K420*K423))","v":0},{"$f":"IF(L415=0,0,0.01*(L421*L423))","v":0},null,null,null,null,{"$f":"1","v":1},{"$f":"1","v":1}]
[null,null,null,null,null,null,null,3,2.5,2,1.5,1,null,null,null,null,{"$f":"1","v":1},{"$f":"1","v":1}]
[null,null,"INNERVEGGER",null,null,"Velg antall innervegger du ønsker å vurdere (deretter trykk «velg»):",null,null,null,null,{"$f":"IF(AND(G424=\"\",G435>0),\"NB! Husk å velge antall elementer...\",\"\")","v":""},null,null,null,{"$f":"IF(ISERROR(O436+O456+O476+O496)/V425,\"\",(O436+O456+O476+O496)/V425)","v":0},null,{"$f":"0","v":0},{"$f":"IF(asstype=2,0,1)","v":1},null,{"$f":"VLOOKUP(G424,$T$1239:$U$1243,2,FALSE)","v":2}]
[null,null,{"$f":"IF(G424=\"\",\"INNERVEGGER\",\"INNERVEGGER (1)\")","v":"INNERVEGGER"},null,null,"Velg datatype:",null,null,null,null,null,null,null,null,null,null,{"$f":"IF(freq6>=3,0,1)","v":1},{"$f":"IF(asstype=2,0,1)","v":1},null,null,{"$f":"IF(G425=\"\",2,IF(ISERROR(VLOOKUP(G425,$T$1246:$U$1247,2,FALSE)),\"\",VLOOKUP(G425,$T$1246:$U$1247,2,FALSE)))","v":2},{"$f":"IF(freq6=3,1,IF(freq6=4,2,IF(freq6=5,3,IF(freq6=6,4,1))))","v":1}]
[null,null,null,{"$f":"IF(AND(P436>=1,type1=1),\"NB! Volum av nivåene kan ikke være større enn det totale volumet for hvert enkelt materiale!\",+IF(AND(P436>=1,type1=2),\"NB! Prosentandel for hvert nivå må registreres i prosent av det vurderte bygningselementet, og den totale prosentandelen kan ikke være større enn den totale prosent av hvert enkelt materiale!\",\"\"))","v":""},null,null,null,null,null,null,null,null,null,null,null,null,1,1]
[null,null,{"$f":"IF(G425=\"\",\"\",IF(SUM(G427:G434)=0,\"\",IF(U425=1,IF(U425+L435=1,\"REGISTRER DET TOTALE VOLUMET AV RELEVANTE MATERIALER\",IF((U425+G435+L435)=1,\"REGISTRER DET TOTALE VOLUMET AV RELEVANTE MATERIALER\",IF(ISERROR(C436),\"REGISTRER DET TOTALE VOLUMET AV RELEVANTE MATERIALER\",IF(OR(G427>L435,G428>L435,G429>L435,G430>L435,G431>L435,G432>L435,G433>L435,G434>L435),\"Volumet av de enkelte materialer kan ikke overstige mengden relevante materialer\",IF(SUM(G427:G434)>L435,\"Den totale mengden av materialer kan ikke overstige det  totale volumet av relevante materialer\",\"\"))))),IF(U425=2,IF(SUM(G427:G434)<80,\"Minst 80 % av de relevante materialer må vurderes, vennligst beregn på nytt.\",IF(OR(G427>100,G428>100,G429>100,G430>100,G431>100,G432>100,G433>100,G434>100),\"Prosentandel av de enkelte materialerer kan ikke overstige 100\",IF(SUM(G427:G434)>100,\"Den totale prosentandelen av materialer kan ikke overstige 100\",\"\")))))))","v":""},null,"Mat. 1",null,null,null,null,null,null,null,{"$f":"IF(SUM(H443+I443+J443+K443+L443)>=3,\"3,00\",SUM(H443+I443+J443+K443+L443))","v":0},{"$f":"IF(AND(U425=1,L435=\"\"),0,IF(OR(NOT(D426=\"\"),NOT(C427=\"\"),NOT(N428=\"\")),0,IF(ISERROR(N436),\"0\",N436)))","v":0},null,{"$f":"IF(SUM(H427:L427)>G427,\"1\",\"0\")","v":"0"},1,1]
[null,null,null,null,"Mat. 2",null,null,null,null,null,null,null,null,{"$f":"IF(AND(U425=1,L435=\"\"),C427,+IF(G436>L435,C427,(IF(N436<80,\"Ingen poeng oppnådd,\nmindre enn 80 % oppfyller kravet\",\"\"))))","v":""},null,{"$f":"IF(SUM(H428:L428)>G428,\"1\",\"0\")","v":"0"},1,1]
[null,null,null,null,"Mat. 3",null,null,null,null,null,null,null,null,null,null,"0",1,1]
[null,null,null,null,"Mat. 4",null,null,null,null,null,null,null,null,null,null,"0",1,1]
[null,null,null,null,"Mat. 5",null,null,null,null,null,null,null,null,null,null,"0",1,1]
[null,null,null,null,"Mat. 6",null,null,null,null,null,null,null,null,null,null,"0",1,1]
[null,null,null,null,"Mat. 7",null,null,null,null,null,null,null,null,null,null,"0",1,1]
[null,null,null,null,"Mat. 8",null,null,null,null,null,null,null,null,null,null,"0",1,1]
[null,null,null,null,"Totalt % av bygningselementet (relevante materialer) vurdert:",null,{"$f":"IF(U425=\"\",0,IF(U425+L435=1,0,IF(SUM(G427:G434)=0,0,IF(U425=1,IF(OR(G427>L435,G428>L435,G429>L435,G430>L435,G431>L435,G432>L435,G433>L435,G434>L435,SUM(G427:G434)>L435),0,((SUM(G427:G434)/L435)*100)),IF(U425=2,IF(OR(G427>100,G428>100,G429>100,G430>100,G431>100,G432>100,G433>100,G434>100,SUM(G427:G434)>100),0,SUM(G427:G434)))))))","v":0},"Samlet volum for aktuelle elementer:",null,null,null,null,null,null,null,null,1,1]
[null,null,{"$f":"IF(G435=0,\"0\",IF(U425=2,\"0\",IF(U425=1,(G435/100)*100,IF(U425=2,(G435/100)*100))))","v":"0"},{"$f":"G435","v":0},null,"Total",{"$f":"IF(SUM(G427:G434)=0,\"1\",SUM(G427:G434))","v":"1"},{"$f":"SUM(H427:H434)","v":0},{"$f":"SUM(I427:I434)","v":0},{"$f":"SUM(J427:J434)","v":0},{"$f":"SUM(K427:K434)","v":0},{"$f":"SUM(L427:L434)","v":0},null,{"$f":"SUM(H437:L437)","v":0},{"$f":"IF(G435<80,\"0,00\",IF(P436>0,\"0\",IF(G435>100,\"0,00\",IF(N427>=80,M427,IF(N427<80,0)))))","v":"0,00"},{"$f":"P427+P428+P429+P430+P431+P432+P433+P434","v":0},{"$f":"1","v":1},{"$f":"1","v":1}]
[null,null,null,null,null,null,"Percentage",{"$f":"IF(H436+G436=0,\"0\",(H436/G436)*100)","v":0},{"$f":"IF(I436+G436=0,\"0\",(I436/G436)*100)","v":0},{"$f":"IF(J436+G436=0,\"0\",(J436/G436)*100)","v":0},{"$f":"IF(K436+G436=0,\"0\",(K436/G436)*100)","v":0},{"$f":"IF(L436+G436=0,\"0\",(L436/G436)*100)","v":0},null,100,null,null,{"$f":"1","v":1},{"$f":"1","v":1}]
[null,null,null,null,null,{"$f":"IF(U425=1,((G436/100)*80))","v":false},"% of 80",{"$f":"(H437/80)*100","v":0},{"$f":"(I437/80)*100","v":0},{"$f":"(J437/80)*100","v":0},{"$f":"(K437/80)*100","v":0},{"$f":"(L437/80)*100","v":0},null,null,null,null,{"$f":"1","v":1},{"$f":"1","v":1}]
[null,null,null,null,null,null,"Limiter",{"$f":"IF(H438>100,\"100\",H438)","v":0},{"$f":"IF(I438>100,\"100\",I438)","v":0},{"$f":"IF(J438>100,\"100\",J438)","v":0},{"$f":"IF(K438>100,\"100\",K438)","v":0},{"$f":"IF(L438>100,\"100\",L438)","v":0},null,null,null,null,{"$f":"1","v":1},{"$f":"1","v":1}]
[null,null,null,null,null,null,null,null,{"$f":"IF(H439+I439+J439+K439+L439=0,0,100-(H439))","v":0},{"$f":"IF(H439+I439+J439+K439+L439=0,0,100-(H439+I439))","v":0},{"$f":"IF(J439+I439+H439+K439+L439=0,0,100-(J439+I439+H439))","v":0},{"$f":"IF(K439+J439+I439+H439+L439=0,0,100-(H439+I439+K439+J439))","v":0},null,null,null,null,{"$f":"1","v":1},{"$f":"1","v":1}]
[null,null,null,null,null,null,null,null,{"$f":"IF(I439>I440,I440,I439)","v":0},{"$f":"IF(J439>J440,J440,J439)","v":0},{"$f":"IF(K439>K440,K440,K439)","v":0},{"$f":"IF(L439>L440,L440,L439)","v":0},null,null,null,null,{"$f":"1","v":1},{"$f":"1","v":1}]
[null,null,null,null,null,null,null,null,null,null,null,{"$f":"IF(K441+J439+H439+I439>=100,0,L441)","v":0},null,null,null,null,{"$f":"1","v":1},{"$f":"1","v":1}]
[null,null,null,null,null,null,"Scores",{"$f":"IF(H436=0,0,0.01*(H439*H444))","v":0},{"$f":"IF(I436=0,0,0.01*(I441*I444))","v":0},{"$f":"IF(J436=0,0,0.01*(J441*J444))","v":0},{"$f":"IF(K436=0,0,0.01*(K441*K444))","v":0},{"$f":"IF(L436=0,0,0.01*(L442*L444))","v":0},null,null,null,null,{"$f":"1","v":1},{"$f":"1","v":1}]
[null,null,null,null,null,null,null,3,2.5,2,1.5,1,null,null,null,null,{"$f":"1","v":1},{"$f":"1","v":1}]
[null,null,"INNERVEGGER (2)",null,null,"Velg datatype:",null,null,null,null,null,null,null,null,null,null,{"$f":"IF(freq6>=4,0,1)","v":1},{"$f":"1","v":1},null,null,{"$f":"IF(G445=\"\",2,IF(ISERROR(VLOOKUP(G445,$T$1246:$U$1247,2,FALSE)),\"\",VLOOKUP(G445,$T$1246:$U$1247,2,FALSE)))","v":2}]
[null,null,null,{"$f":"IF(AND(P456>=1,type1=1),\"NB! Volum av nivåene kan ikke være større enn det totale volumet for hvert enkelt materiale!\",+IF(AND(P456>=1,type1=2),\"NB! Prosentandel for hvert nivå må registreres i prosent av det vurderte bygningselementet, og den totale prosentandelen kan ikke være større enn den totale prosent av hvert enkelt materiale!\",\"\"))","v":""},null,null,null,null,null,null,null,null,null,null,null,null,1,{"$f":"1","v":1}]
[null,null,{"$f":"IF(G445=\"\",\"\",IF(SUM(G447:G454)=0,\"\",IF(U445=1,IF(U445+L455=1,\"REGISTRER DET TOTALE VOLUMET AV RELEVANTE MATERIALER\",IF((U445+G455+L455)=1,\"REGISTRER DET TOTALE VOLUMET AV RELEVANTE MATERIALER\",IF(ISERROR(C456),\"REGISTRER DET TOTALE VOLUMET AV RELEVANTE MATERIALER\",IF(OR(G447>L455,G448>L455,G449>L455,G450>L455,G451>L455,G452>L455,G453>L455,G454>L455),\"Volumet av de enkelte materialer kan ikke overstige mengden relevante materialer\",IF(SUM(G447:G454)>L455,\"Den totale mengden av materialer kan ikke overstige det  totale volumet av relevante materialer\",\"\"))))),IF(U445=2,IF(SUM(G447:G454)<80,\"Minst 80 % av de relevante materialer må vurderes, vennligst beregn på nytt.\",IF(OR(G447>100,G448>100,G449>100,G450>100,G451>100,G452>100,G453>100,G454>100),\"Prosentandel av de enkelte materialerer kan ikke overstige 100\",IF(SUM(G447:G454)>100,\"Den totale prosentandelen av materialer kan ikke overstige 100\",\"\")))))))","v":""},null,"Mat. 1",null,null,null,null,null,null,null,{"$f":"IF(SUM(H463+I463+J463+K463+L463)>=3,\"3,00\",SUM(H463+I463+J463+K463+L463))","v":0},{"$f":"IF(AND(U449=1,L455=\"\"),0,IF(OR(NOT(D446=\"\"),NOT(C447=\"\"),NOT(N448=\"\")),0,IF(ISERROR(N456),\"0\",N456)))","v":0},null,{"$f":"IF(SUM(H447:L447)>G447,\"1\",\"0\")","v":"0"},1,{"$f":"1","v":1}]
[null,null,null,null,"Mat. 2",null,null,null,null,null,null,null,null,{"$f":"IF(AND(U445=1,L455=\"\"),C447,+IF(G456>L455,C447,(IF(N456<80,\"Ingen poeng oppnådd,\nmindre enn 80 % oppfyller kravet\",\"\"))))","v":""},null,{"$f":"IF(SUM(H448:L448)>G448,\"1\",\"0\")","v":"0"},1,{"$f":"1","v":1}]
[null,null,null,null,"Mat. 3",null,null,null,null,null,null,null,null,null,null,"0",1,{"$f":"1","v":1}]
[null,null,null,null,"Mat. 4",null,null,null,null,null,null,null,null,null,null,"0",1,{"$f":"1","v":1}]
[null,null,null,null,"Mat. 5",null,null,null,null,null,null,null,null,null,null,"0",1,{"$f":"1","v":1}]
[null,null,null,null,"Mat. 6",null,null,null,null,null,null,null,null,null,null,"0",1,{"$f":"1","v":1}]
[null,null,null,null,"Mat. 7",null,null,null,null,null,null,null,null,null,null,"0",1,{"$f":"1","v":1}]
[null,null,null,null,"Mat. 8",null,null,null,null,null,null,null,null,null,null,"0",1,{"$f":"1","v":1}]
[null,null,null,null,"Totalt % av bygningselementet (relevante materialer) vurdert:",null,{"$f":"IF(U445=\"\",0,IF(U445+L455=1,0,IF(SUM(G447:G454)=0,0,IF(U445=1,IF(OR(G447>L455,G448>L455,G449>L455,G450>L455,G451>L455,G452>L455,G453>L455,G454>L455,SUM(G447:G454)>L455),0,((SUM(G447:G454)/L455)*100)),IF(U445=2,IF(OR(G447>100,G448>100,G449>100,G450>100,G451>100,G452>100,G453>100,G454>100,SUM(G447:G454)>100),0,SUM(G447:G454)))))))","v":0},"Samlet volum for aktuelle elementer:",null,null,null,null,null,null,null,null,1,{"$f":"1","v":1}]
[null,null,{"$f":"IF(G455=0,\"0\",IF(U445=2,\"0\",IF(U445=1,(G455/100)*100,IF(U445=2,(G455/100)*100))))","v":"0"},{"$f":"G455","v":0},null,"Total",{"$f":"IF(SUM(G447:G454)=0,\"1\",SUM(G447:G454))","v":"1"},{"$f":"SUM(H447:H454)","v":0},{"$f":"SUM(I447:I454)","v":0},{"$f":"SUM(J447:J454)","v":0},{"$f":"SUM(K447:K454)","v":0},{"$f":"SUM(L447:L454)","v":0},null,{"$f":"SUM(H457:L457)","v":0},{"$f":"IF(G455<80,\"0,00\",IF(P456>0,\"0\",IF(G455>100,\"0,00\",IF(N447>=80,M447,IF(N447<80,0)))))","v":"0,00"},{"$f":"P447+P448+P449+P450+P451+P452+P453+P454","v":0},{"$f":"1","v":1},{"$f":"1","v":1}]
[null,null,null,null,null,null,"Percentage",{"$f":"IF(H456+G456=0,\"0\",(H456/G456)*100)","v":0},{"$f":"IF(I456+G456=0,\"0\",(I456/G456)*100)","v":0},{"$f":"IF(J456+G456=0,\"0\",(J456/G456)*100)","v":0},{"$f":"IF(K456+G456=0,\"0\",(K456/G456)*100)","v":0},{"$f":"IF(L456+G456=0,\"0\",(L456/G456)*100)","v":0},null,100,null,null,{"$f":"1","v":1},{"$f":"1","v":1}]
[null,null,null,null,null,{"$f":"IF(U445=1,((G456/100)*80))","v":false},"% of 80",{"$f":"(H457/80)*100","v":0},{"$f":"(I457/80)*100","v":0},{"$f":"(J457/80)*100","v":0},{"$f":"(K457/80)*100","v":0},{"$f":"(L457/80)*100","v":0},null,null,null,null,{"$f":"1","v":1},{"$f":"1","v":1}]
[null,null,null,null,null,null,"Limiter",{"$f":"IF(H458>100,\"100\",H458)","v":0},{"$f":"IF(I458>100,\"100\",I458)","v":0},{"$f":"IF(J458>100,\"100\",J458)","v":0},{"$f":"IF(K458>100,\"100\",K458)","v":0},{"$f":"IF(L458>100,\"100\",L458)","v":0},null,null,null,null,{"$f":"1","v":1},{"$f":"1","v":1}]
[null,null,null,null,null,null,null,null,{"$f":"IF(H459+I459+J459+K459+L459=0,0,100-(H459))","v":0},{"$f":"IF(H459+I459+J459+K459+L459=0,0,100-(H459+I459))","v":0},{"$f":"IF(J459+I459+H459+K459+L459=0,0,100-(J459+I459+H459))","v":0},{"$f":"IF(K459+J459+I459+H459+L459=0,0,100-(H459+I459+K459+J459))","v":0},null,null,null,null,{"$f":"1","v":1},{"$f":"1","v":1}]
[null,null,null,null,null,null,null,null,{"$f":"IF(I459>I460,I460,I459)","v":0},{"$f":"IF(J459>J460,J460,J459)","v":0},{"$f":"IF(K459>K460,K460,K459)","v":0},{"$f":"IF(L459>L460,L460,L459)","v":0},null,null,null,null,{"$f":"1","v":1},{"$f":"1","v":1}]
[null,null,null,null,null,null,null,null,null,null,null,{"$f":"IF(K461+J459+H459+I459>=100,0,L461)","v":0},null,null,null,null,{"$f":"1","v":1},{"$f":"1","v":1}]
[null,null,null,null,null,null,"Scores",{"$f":"IF(H456=0,0,0.01*(H459*H464))","v":0},{"$f":"IF(I456=0,0,0.01*(I461*I464))","v":0},{"$f":"IF(J456=0,0,0.01*(J461*J464))","v":0},{"$f":"IF(K456=0,0,0.01*(K461*K464))","v":0},{"$f":"IF(L456=0,0,0.01*(L462*L464))","v":0},null,null,null,null,{"$f":"1","v":1},{"$f":"1","v":1}]
[null,null,null,null,null,null,null,3,2.5,2,1.5,1,null,null,null,null,{"$f":"1","v":1},{"$f":"1","v":1}]
[null,null,"INNERVEGGER (3)",null,null,"Velg datatype:",null,null,null,null,null,null,null,null,null,null,{"$f":"IF(freq6>=5,0,1)","v":1},{"$f":"1","v":1},null,null,{"$f":"IF(G465=\"\",2,IF(ISERROR(VLOOKUP(G465,$T$1246:$U$1247,2,FALSE)),\"\",VLOOKUP(G465,$T$1246:$U$1247,2,FALSE)))","v":2}]
[null,null,null,{"$f":"IF(AND(P476>=1,type1=1),\"NB! Volum av nivåene kan ikke være større enn det totale volumet for hvert enkelt materiale!\",+IF(AND(P476>=1,type1=2),\"NB! Prosentandel for hvert nivå må registreres i prosent av det vurderte bygningselementet, og den totale prosentandelen kan ikke være større enn den totale prosent av hvert enkelt materiale!\",\"\"))","v":""},null,null,null,null,null,null,null,null,null,null,null,null,1,{"$f":"1","v":1}]
[null,null,{"$f":"IF(G465=\"\",\"\",IF(SUM(G467:G474)=0,\"\",IF(U465=1,IF(U465+L475=1,\"REGISTRER DET TOTALE VOLUMET AV RELEVANTE MATERIALER\",IF((U465+G475+L475)=1,\"REGISTRER DET TOTALE VOLUMET AV RELEVANTE MATERIALER\",IF(ISERROR(C476),\"REGISTRER DET TOTALE VOLUMET AV RELEVANTE MATERIALER\",IF(OR(G467>L475,G468>L475,G469>L475,G470>L475,G471>L475,G472>L475,G473>L475,G474>L475),\"Volumet av de enkelte materialer kan ikke overstige mengden relevante materialer\",IF(SUM(G467:G474)>L475,\"Den totale mengden av materialer kan ikke overstige det  totale volumet av relevante materialer\",\"\"))))),IF(U465=2,IF(SUM(G467:G474)<80,\"Minst 80 % av de relevante materialer må vurderes, vennligst beregn på nytt.\",IF(OR(G467>100,G468>100,G469>100,G470>100,G471>100,G472>100,G473>100,G474>100),\"Prosentandel av de enkelte materialerer kan ikke overstige 100\",IF(SUM(G467:G474)>100,\"Den totale prosentandelen av materialer kan ikke overstige 100\",\"\")))))))","v":""},null,"Mat. 1",null,null,null,null,null,null,null,{"$f":"IF(SUM(H483+I483+J483+K483+L483)>=3,\"3,00\",SUM(H483+I483+J483+K483+L483))","v":0},{"$f":"IF(AND(U469=1,L475=\"\"),0,IF(OR(NOT(D466=\"\"),NOT(C467=\"\"),NOT(N468=\"\")),0,IF(ISERROR(N476),\"0\",N476)))","v":0},null,{"$f":"IF(SUM(H467:L467)>G467,\"1\",\"0\")","v":"0"},1,{"$f":"1","v":1}]
[null,null,null,null,"Mat. 2",null,null,null,null,null,null,null,null,{"$f":"IF(AND(U465=1,L475=\"\"),C467,+IF(G476>L475,C467,(IF(N476<80,\"Ingen poeng oppnådd,\nmindre enn 80 % oppfyller kravet\",\"\"))))","v":""},null,{"$f":"IF(SUM(H468:L468)>G468,\"1\",\"0\")","v":"0"},1,{"$f":"1","v":1}]
[null,null,null,null,"Mat. 3",null,null,null,null,null,null,null,null,null,null,"0",1,{"$f":"1","v":1}]
[null,null,null,null,"Mat. 4",null,null,null,null,null,null,null,null,null,null,"0",1,{"$f":"1","v":1}]
[null,null,null,null,"Mat. 5",null,null,null,null,null,null,null,null,null,null,"0",1,{"$f":"1","v":1}]
[null,null,null,null,"Mat. 6",null,null,null,null,null,null,null,null,null,null,"0",1,{"$f":"1","v":1}]
[null,null,null,null,"Mat. 7",null,null,null,null,null,null,null,null,null,null,"0",1,{"$f":"1","v":1}]
[null,null,null,null,"Mat. 8",null,null,null,null,null,null,null,null,null,null,"0",1,{"$f":"1","v":1}]
[null,null,null,null,"Totalt % av bygningselementet (relevante materialer) vurdert:",null,{"$f":"IF(U465=\"\",0,IF(U465+L475=1,0,IF(SUM(G467:G474)=0,0,IF(U465=1,IF(OR(G467>L475,G468>L475,G469>L475,G470>L475,G471>L475,G472>L475,G473>L475,G474>L475,SUM(G467:G474)>L475),0,((SUM(G467:G474)/L475)*100)),IF(U465=2,IF(OR(G467>100,G468>100,G469>100,G470>100,G471>100,G472>100,G473>100,G474>100,SUM(G467:G474)>100),0,SUM(G467:G474)))))))","v":0},"Samlet volum for aktuelle elementer:",null,null,null,null,null,null,null,null,1,{"$f":"1","v":1}]
[null,null,{"$f":"IF(G475=0,\"0\",IF(U465=2,\"0\",IF(U465=1,(G475/100)*100,IF(U465=2,(G475/100)*100))))","v":"0"},{"$f":"G475","v":0},null,"Total",{"$f":"IF(SUM(G467:G474)=0,\"1\",SUM(G467:G474))","v":"1"},{"$f":"SUM(H467:H474)","v":0},{"$f":"SUM(I467:I474)","v":0},{"$f":"SUM(J467:J474)","v":0},{"$f":"SUM(K467:K474)","v":0},{"$f":"SUM(L467:L474)","v":0},null,{"$f":"SUM(H477:L477)","v":0},{"$f":"IF(G475<80,\"0,00\",IF(P476>0,\"0\",IF(G475>100,\"0,00\",IF(N467>=80,M467,IF(N467<80,0)))))","v":"0,00"},{"$f":"P467+P468+P469+P470+P471+P472+P473+P474","v":0},{"$f":"1","v":1},{"$f":"1","v":1}]
[null,null,null,null,null,null,"Percentage",{"$f":"IF(H476+G476=0,\"0\",(H476/G476)*100)","v":0},{"$f":"IF(I476+G476=0,\"0\",(I476/G476)*100)","v":0},{"$f":"IF(J476+G476=0,\"0\",(J476/G476)*100)","v":0},{"$f":"IF(K476+G476=0,\"0\",(K476/G476)*100)","v":0},{"$f":"IF(L476+G476=0,\"0\",(L476/G476)*100)","v":0},null,100,null,null,{"$f":"1","v":1},{"$f":"1","v":1}]
[null,null,null,null,null,{"$f":"IF(U465=1,((G476/100)*80))","v":false},"% of 80",{"$f":"(H477/80)*100","v":0},{"$f":"(I477/80)*100","v":0},{"$f":"(J477/80)*100","v":0},{"$f":"(K477/80)*100","v":0},{"$f":"(L477/80)*100","v":0},null,null,null,null,{"$f":"1","v":1},{"$f":"1","v":1}]
[null,null,null,null,null,null,"Limiter",{"$f":"IF(H478>100,\"100\",H478)","v":0},{"$f":"IF(I478>100,\"100\",I478)","v":0},{"$f":"IF(J478>100,\"100\",J478)","v":0},{"$f":"IF(K478>100,\"100\",K478)","v":0},{"$f":"IF(L478>100,\"100\",L478)","v":0},null,null,null,null,{"$f":"1","v":1},{"$f":"1","v":1}]
[null,null,null,null,null,null,null,null,{"$f":"IF(H479+I479+J479+K479+L479=0,0,100-(H479))","v":0},{"$f":"IF(H479+I479+J479+K479+L479=0,0,100-(H479+I479))","v":0},{"$f":"IF(J479+I479+H479+K479+L479=0,0,100-(J479+I479+H479))","v":0},{"$f":"IF(K479+J479+I479+H479+L479=0,0,100-(H479+I479+K479+J479))","v":0},null,null,null,null,{"$f":"1","v":1},{"$f":"1","v":1}]
[null,null,null,null,null,null,null,null,{"$f":"IF(I479>I480,I480,I479)","v":0},{"$f":"IF(J479>J480,J480,J479)","v":0},{"$f":"IF(K479>K480,K480,K479)","v":0},{"$f":"IF(L479>L480,L480,L479)","v":0},null,null,null,null,{"$f":"1","v":1},{"$f":"1","v":1}]
[null,null,null,null,null,null,null,null,null,null,null,{"$f":"IF(K481+J479+H479+I479>=100,0,L481)","v":0},null,null,null,null,{"$f":"1","v":1},{"$f":"1","v":1}]
[null,null,null,null,null,null,"Scores",{"$f":"IF(H476=0,0,0.01*(H479*H484))","v":0},{"$f":"IF(I476=0,0,0.01*(I481*I484))","v":0},{"$f":"IF(J476=0,0,0.01*(J481*J484))","v":0},{"$f":"IF(K476=0,0,0.01*(K481*K484))","v":0},{"$f":"IF(L476=0,0,0.01*(L482*L484))","v":0},null,null,null,null,{"$f":"1","v":1},{"$f":"1","v":1}]
[null,null,null,null,null,null,null,3,2.5,2,1.5,1,null,null,null,null,{"$f":"1","v":1},{"$f":"1","v":1}]
[null,null,"INNERVEGGER (4)",null,null,"Velg datatype:",null,null,null,null,null,null,null,null,null,null,{"$f":"IF(freq6>=6,0,1)","v":1},{"$f":"1","v":1},null,null,{"$f":"IF(G485=\"\",2,IF(ISERROR(VLOOKUP(G485,$T$1246:$U$1247,2,FALSE)),\"\",VLOOKUP(G485,$T$1246:$U$1247,2,FALSE)))","v":2}]
[null,null,null,{"$f":"IF(AND(P496>=1,type1=1),\"NB! Volum av nivåene kan ikke være større enn det totale volumet for hvert enkelt materiale!\",+IF(AND(P496>=1,type1=2),\"NB! Prosentandel for hvert nivå må registreres i prosent av det vurderte bygningselementet, og den totale prosentandelen kan ikke være større enn den totale prosent av hvert enkelt materiale!\",\"\"))","v":""},null,null,null,null,null,null,null,null,null,null,null,null,1,{"$f":"1","v":1}]
[null,null,{"$f":"IF(G485=\"\",\"\",IF(SUM(G487:G494)=0,\"\",IF(U485=1,IF(U485+L495=1,\"REGISTRER DET TOTALE VOLUMET AV RELEVANTE MATERIALER\",IF((U485+G495+L495)=1,\"REGISTRER DET TOTALE VOLUMET AV RELEVANTE MATERIALER\",IF(ISERROR(C496),\"REGISTRER DET TOTALE VOLUMET AV RELEVANTE MATERIALER\",IF(OR(G487>L495,G488>L495,G489>L495,G490>L495,G491>L495,G492>L495,G493>L495,G494>L495),\"Volumet av de enkelte materialer kan ikke overstige mengden relevante materialer\",IF(SUM(G487:G494)>L495,\"Den totale mengden av materialer kan ikke overstige det  totale volumet av relevante materialer\",\"\"))))),IF(U485=2,IF(SUM(G487:G494)<80,\"Minst 80 % av de relevante materialer må vurderes, vennligst beregn på nytt.\",IF(OR(G487>100,G488>100,G489>100,G490>100,G491>100,G492>100,G493>100,G494>100),\"Prosentandel av de enkelte materialerer kan ikke overstige 100\",IF(SUM(G487:G494)>100,\"Den totale prosentandelen av materialer kan ikke overstige 100\",\"\")))))))","v":""},null,"Mat. 1",null,null,null,null,null,null,null,{"$f":"IF(SUM(H503+I503+J503+K503+L503)>=3,\"3,00\",SUM(H503+I503+J503+K503+L503))","v":0},{"$f":"IF(AND(U489=1,L495=\"\"),0,IF(OR(NOT(D486=\"\"),NOT(C487=\"\"),NOT(N488=\"\")),0,IF(ISERROR(N496),\"0\",N496)))","v":0},null,{"$f":"IF(SUM(H487:L487)>G487,\"1\",\"0\")","v":"0"},1,{"$f":"1","v":1}]
[null,null,null,null,"Mat. 2",null,null,null,null,null,null,null,null,{"$f":"IF(AND(U485=1,L495=\"\"),C487,+IF(G496>L495,C487,(IF(N496<80,\"Ingen poeng oppnådd,\nmindre enn 80 % oppfyller kravet\",\"\"))))","v":""},null,{"$f":"IF(SUM(H488:L488)>G488,\"1\",\"0\")","v":"0"},1,{"$f":"1","v":1}]
[null,null,null,null,"Mat. 3",null,null,null,null,null,null,null,null,null,null,"0",1,{"$f":"1","v":1}]
[null,null,null,null,"Mat. 4",null,null,null,null,null,null,null,null,null,null,"0",1,{"$f":"1","v":1}]
[null,null,null,null,"Mat. 5",null,null,null,null,null,null,null,null,null,null,"0",1,{"$f":"1","v":1}]
[null,null,null,null,"Mat. 6",null,null,null,null,null,null,null,null,null,null,"0",1,{"$f":"1","v":1}]
[null,null,null,null,"Mat. 7",null,null,null,null,null,null,null,null,null,null,"0",1,{"$f":"1","v":1}]
[null,null,null,null,"Mat. 8",null,null,null,null,null,null,null,null,null,null,"0",1,{"$f":"1","v":1}]
[null,null,null,null,"Totalt % av bygningselementet (relevante materialer) vurdert:",null,{"$f":"IF(U485=\"\",0,IF(U485+L495=1,0,IF(SUM(G487:G494)=0,0,IF(U485=1,IF(OR(G487>L495,G488>L495,G489>L495,G490>L495,G491>L495,G492>L495,G493>L495,G494>L495,SUM(G487:G494)>L495),0,((SUM(G487:G494)/L495)*100)),IF(U485=2,IF(OR(G487>100,G488>100,G489>100,G490>100,G491>100,G492>100,G493>100,G494>100,SUM(G487:G494)>100),0,SUM(G487:G494)))))))","v":0},"Samlet volum for aktuelle elementer:",null,null,null,null,null,null,null,null,1,{"$f":"1","v":1}]
[null,null,{"$f":"IF(G495=0,\"0\",IF(U485=2,\"0\",IF(U485=1,(G495/100)*100,IF(U485=2,(G495/100)*100))))","v":"0"},{"$f":"G495","v":0},null,"Total",{"$f":"IF(SUM(G487:G494)=0,\"1\",SUM(G487:G494))","v":"1"},{"$f":"SUM(H487:H494)","v":0},{"$f":"SUM(I487:I494)","v":0},{"$f":"SUM(J487:J494)","v":0},{"$f":"SUM(K487:K494)","v":0},{"$f":"SUM(L487:L494)","v":0},null,{"$f":"SUM(H497:L497)","v":0},{"$f":"IF(G495<80,\"0,00\",IF(P496>0,\"0\",IF(G495>100,\"0,00\",IF(N487>=80,M487,IF(N487<80,0)))))","v":"0,00"},{"$f":"P487+P488+P489+P490+P491+P492+P493+P494","v":0},{"$f":"1","v":1},{"$f":"1","v":1}]
[null,null,null,null,null,null,"Percentage",{"$f":"IF(H496+G496=0,\"0\",(H496/G496)*100)","v":0},{"$f":"IF(I496+G496=0,\"0\",(I496/G496)*100)","v":0},{"$f":"IF(J496+G496=0,\"0\",(J496/G496)*100)","v":0},{"$f":"IF(K496+G496=0,\"0\",(K496/G496)*100)","v":0},{"$f":"IF(L496+G496=0,\"0\",(L496/G496)*100)","v":0},null,100,null,null,{"$f":"1","v":1},{"$f":"1","v":1}]
[null,null,null,null,null,{"$f":"IF(U485=1,((G496/100)*80))","v":false},"% of 80",{"$f":"(H497/80)*100","v":0},{"$f":"(I497/80)*100","v":0},{"$f":"(J497/80)*100","v":0},{"$f":"(K497/80)*100","v":0},{"$f":"(L497/80)*100","v":0},null,null,null,null,{"$f":"1","v":1},{"$f":"1","v":1}]
[null,null,null,null,null,null,"Limiter",{"$f":"IF(H498>100,\"100\",H498)","v":0},{"$f":"IF(I498>100,\"100\",I498)","v":0},{"$f":"IF(J498>100,\"100\",J498)","v":0},{"$f":"IF(K498>100,\"100\",K498)","v":0},{"$f":"IF(L498>100,\"100\",L498)","v":0},null,null,null,null,{"$f":"1","v":1},{"$f":"1","v":1}]
[null,null,null,null,null,null,null,null,{"$f":"IF(H499+I499+J499+K499+L499=0,0,100-(H499))","v":0},{"$f":"IF(H499+I499+J499+K499+L499=0,0,100-(H499+I499))","v":0},{"$f":"IF(J499+I499+H499+K499+L499=0,0,100-(J499+I499+H499))","v":0},{"$f":"IF(K499+J499+I499+H499+L499=0,0,100-(H499+I499+K499+J499))","v":0},null,null,null,null,{"$f":"1","v":1},{"$f":"1","v":1}]
[null,null,null,null,null,null,null,null,{"$f":"IF(I499>I500,I500,I499)","v":0},{"$f":"IF(J499>J500,J500,J499)","v":0},{"$f":"IF(K499>K500,K500,K499)","v":0},{"$f":"IF(L499>L500,L500,L499)","v":0},null,null,null,null,{"$f":"1","v":1},{"$f":"1","v":1}]
[null,null,null,null,null,null,null,null,null,null,null,{"$f":"IF(K501+J499+H499+I499>=100,0,L501)","v":0},null,null,null,null,{"$f":"1","v":1},{"$f":"1","v":1}]
[null,null,null,null,null,null,"Scores",{"$f":"IF(H496=0,0,0.01*(H499*H504))","v":0},{"$f":"IF(I496=0,0,0.01*(I501*I504))","v":0},{"$f":"IF(J496=0,0,0.01*(J501*J504))","v":0},{"$f":"IF(K496=0,0,0.01*(K501*K504))","v":0},{"$f":"IF(L496=0,0,0.01*(L502*L504))","v":0},null,null,null,null,{"$f":"1","v":1},{"$f":"1","v":1}]
[null,null,null,null,null,null,null,3,2.5,2,1.5,1,null,null,null,null,{"$f":"1","v":1},{"$f":"1","v":1}]
[null,null,"FUNDAMENT/GRUNNMUR",null,null,"Velg antall fundament/grunnmur du ønsker å vurdere (deretter trykk «velg»):",null,null,null,null,{"$f":"IF(AND(G505=\"\",G516>0),\"NB! Husk å velge antall elementer...\",\"\")","v":""},null,null,null,{"$f":"IF(ISERROR(O517+O537+O557+O577)/V506,\"\",(O517+O537+O557+O577)/V506)","v":0},null,{"$f":"0","v":0},{"$f":"IF(asstype=2,0,1)","v":1},null,{"$f":"VLOOKUP(G505,$T$1239:$U$1243,2,FALSE)","v":2}]
[null,null,{"$f":"IF(G505=\"\",\"FUNDAMENT/GRUNNMUR\",\"FUNDAMENT/GRUNNMUR (1)\")","v":"FUNDAMENT/GRUNNMUR"},null,null,"Velg datatype:",null,null,null,null,null,null,null,null,null,null,{"$f":"IF(freq7>=3,0,1)","v":1},1,null,null,{"$f":"IF(G506=\"\",2,IF(ISERROR(VLOOKUP(G506,$T$1246:$U$1247,2,FALSE)),\"\",VLOOKUP(G506,$T$1246:$U$1247,2,FALSE)))","v":2},{"$f":"IF(freq7=3,1,IF(freq7=4,2,IF(freq7=5,3,IF(freq7=6,4,1))))","v":1}]
[null,null,null,{"$f":"IF(AND(P517>=1,type1=1),\"NB! Volum av nivåene kan ikke være større enn det totale volumet for hvert enkelt materiale!\",+IF(AND(P517>=1,type1=2),\"NB! Prosentandel for hvert nivå må registreres i prosent av det vurderte bygningselementet, og den totale prosentandelen kan ikke være større enn den totale prosent av hvert enkelt materiale!\",\"\"))","v":""},null,null,null,null,null,null,null,null,null,null,null,null,{"$f":"IF(freq7>=3,0,1)","v":1},1]
[null,null,{"$f":"IF(G506=\"\",\"\",IF(SUM(G508:G515)=0,\"\",IF(U506=1,IF(U506+L516=1,\"REGISTRER DET TOTALE VOLUMET AV RELEVANTE MATERIALER\",IF((U506+G516+L516)=1,\"REGISTRER DET TOTALE VOLUMET AV RELEVANTE MATERIALER\",IF(ISERROR(C517),\"REGISTRER DET TOTALE VOLUMET AV RELEVANTE MATERIALER\",IF(OR(G508>L516,G509>L516,G510>L516,G511>L516,G512>L516,G513>L516,G514>L516,G515>L516),\"Volumet av de enkelte materialer kan ikke overstige mengden relevante materialer\",IF(SUM(G508:G515)>L516,\"Den totale mengden av materialer kan ikke overstige det  totale volumet av relevante materialer\",\"\"))))),IF(U506=2,IF(SUM(G508:G515)<80,\"Minst 80 % av de relevante materialer må vurderes, vennligst beregn på nytt.\",IF(OR(G508>100,G509>100,G510>100,G511>100,G512>100,G513>100,G514>100,G515>100),\"Prosentandel av de enkelte materialerer kan ikke overstige 100\",IF(SUM(G508:G515)>100,\"Den totale prosentandelen av materialer kan ikke overstige 100\",\"\")))))))","v":""},null,"Mat. 1",null,null,null,null,null,null,null,{"$f":"IF(SUM(H524+I524+J524+K524+L524)>=3,\"3,00\",SUM(H524+I524+J524+K524+L524))","v":0},{"$f":"IF(AND(U506=1,L516=\"\"),0,IF(OR(NOT(D507=\"\"),NOT(C508=\"\"),NOT(N509=\"\")),0,IF(ISERROR(N517),\"0\",N517)))","v":0},null,{"$f":"IF(SUM(H508:L508)>G508,\"1\",\"0\")","v":"0"},1,1]
[null,null,null,null,"Mat. 2",null,null,null,null,null,null,null,null,{"$f":"IF(AND(U506=1,L516=\"\"),C508,+IF(G517>L516,C508,(IF(N517<80,\"Ingen poeng oppnådd,\nmindre enn 80 % oppfyller kravet\",\"\"))))","v":""},null,{"$f":"IF(SUM(H509:L509)>G509,\"1\",\"0\")","v":"0"},1,1]
[null,null,null,null,"Mat. 3",null,null,null,null,null,null,null,null,null,null,"0",1,1]
[null,null,null,null,"Mat. 4",null,null,null,null,null,null,null,null,null,null,"0",1,1]
[null,null,null,null,"Mat. 5",null,null,null,null,null,null,null,null,null,null,"0",1,1]
[null,null,null,null,"Mat. 6",null,null,null,null,null,null,null,null,null,null,"0",1,1]
[null,null,null,null,"Mat. 7",null,null,null,null,null,null,null,null,null,null,"0",1,1]
[null,null,null,null,"Mat. 8",null,null,null,null,null,null,null,null,null,null,"0",1,1]
[null,null,null,null,"Totalt % av bygningselementet (relevante materialer) vurdert:",null,{"$f":"IF(U506=\"\",0,IF(U506+L516=1,0,IF(SUM(G508:G515)=0,0,IF(U506=1,IF(OR(G508>L516,G509>L516,G510>L516,G511>L516,G512>L516,G513>L516,G514>L516,G515>L516,SUM(G508:G515)>L516),0,((SUM(G508:G515)/L516)*100)),IF(U506=2,IF(OR(G508>100,G509>100,G510>100,G511>100,G512>100,G513>100,G514>100,G515>100,SUM(G508:G515)>100),0,SUM(G508:G515)))))))","v":0},"Samlet volum for aktuelle elementer:",null,null,null,null,null,null,null,null,1,1]
[null,null,{"$f":"IF(G516=0,\"0\",IF(U506=2,\"0\",IF(U506=1,(G516/100)*100,IF(U506=2,(G516/100)*100))))","v":"0"},{"$f":"G516","v":0},null,"Total",{"$f":"IF(SUM(G508:G515)=0,\"1\",SUM(G508:G515))","v":"1"},{"$f":"SUM(H508:H515)","v":0},{"$f":"SUM(I508:I515)","v":0},{"$f":"SUM(J508:J515)","v":0},{"$f":"SUM(K508:K515)","v":0},{"$f":"SUM(L508:L515)","v":0},null,{"$f":"SUM(H518:L518)","v":0},{"$f":"IF(G516<80,\"0,00\",IF(P517>0,\"0\",IF(G516>100,\"0,00\",IF(N508>=80,M508,IF(N508<80,0)))))","v":"0,00"},{"$f":"P508+P509+P510+P511+P512+P513+P514+P515","v":0},{"$f":"1","v":1},{"$f":"1","v":1}]
[null,null,null,null,null,null,"Percentage",{"$f":"IF(H517+G517=0,\"0\",(H517/G517)*100)","v":0},{"$f":"IF(I517+G517=0,\"0\",(I517/G517)*100)","v":0},{"$f":"IF(J517+G517=0,\"0\",(J517/G517)*100)","v":0},{"$f":"IF(K517+G517=0,\"0\",(K517/G517)*100)","v":0},{"$f":"IF(L517+G517=0,\"0\",(L517/G517)*100)","v":0},null,100,null,null,{"$f":"1","v":1},{"$f":"1","v":1}]
[null,null,null,null,null,{"$f":"IF(U506=1,((G517/100)*80))","v":false},"% of 80",{"$f":"(H518/80)*100","v":0},{"$f":"(I518/80)*100","v":0},{"$f":"(J518/80)*100","v":0},{"$f":"(K518/80)*100","v":0},{"$f":"(L518/80)*100","v":0},null,null,null,null,{"$f":"1","v":1},{"$f":"1","v":1}]
[null,null,null,null,null,null,"Limiter",{"$f":"IF(H519>100,\"100\",H519)","v":0},{"$f":"IF(I519>100,\"100\",I519)","v":0},{"$f":"IF(J519>100,\"100\",J519)","v":0},{"$f":"IF(K519>100,\"100\",K519)","v":0},{"$f":"IF(L519>100,\"100\",L519)","v":0},null,null,null,null,{"$f":"1","v":1},{"$f":"1","v":1}]
[null,null,null,null,null,null,null,null,{"$f":"IF(H520+I520+J520+K520+L520=0,0,100-(H520))","v":0},{"$f":"IF(H520+I520+J520+K520+L520=0,0,100-(H520+I520))","v":0},{"$f":"IF(J520+I520+H520+K520+L520=0,0,100-(J520+I520+H520))","v":0},{"$f":"IF(K520+J520+I520+H520+L520=0,0,100-(H520+I520+K520+J520))","v":0},null,null,null,null,{"$f":"1","v":1},{"$f":"1","v":1}]
[null,null,null,null,null,null,null,null,{"$f":"IF(I520>I521,I521,I520)","v":0},{"$f":"IF(J520>J521,J521,J520)","v":0},{"$f":"IF(K520>K521,K521,K520)","v":0},{"$f":"IF(L520>L521,L521,L520)","v":0},null,null,null,null,{"$f":"1","v":1},{"$f":"1","v":1}]
[null,null,null,null,null,null,null,null,null,null,null,{"$f":"IF(K522+J520+H520+I520>=100,0,L522)","v":0},null,null,null,null,{"$f":"1","v":1},{"$f":"1","v":1}]
[null,null,null,null,null,null,"Scores",{"$f":"IF(H517=0,0,0.01*(H520*H525))","v":0},{"$f":"IF(I517=0,0,0.01*(I522*I525))","v":0},{"$f":"IF(J517=0,0,0.01*(J522*J525))","v":0},{"$f":"IF(K517=0,0,0.01*(K522*K525))","v":0},{"$f":"IF(L517=0,0,0.01*(L523*L525))","v":0},null,null,null,null,{"$f":"1","v":1},{"$f":"1","v":1}]
[null,null,null,null,null,null,null,3,2.5,2,1.5,1,"Total",null,null,null,{"$f":"1","v":1},{"$f":"1","v":1}]
[null,null,"FUNDAMENT/GRUNNMUR (2)",null,null,"Velg datatype:",null,null,null,null,null,null,null,null,null,null,{"$f":"IF(freq7>=4,0,1)","v":1},{"$f":"1","v":1},null,null,{"$f":"IF(G526=\"\",2,IF(ISERROR(VLOOKUP(G526,$T$1246:$U$1247,2,FALSE)),\"\",VLOOKUP(G526,$T$1246:$U$1247,2,FALSE)))","v":2}]
[null,null,null,{"$f":"IF(AND(P537>=1,type1=1),\"NB! Volum av nivåene kan ikke være større enn det totale volumet for hvert enkelt materiale!\",+IF(AND(P537>=1,type1=2),\"NB! Prosentandel for hvert nivå må registreres i prosent av det vurderte bygningselementet, og den totale prosentandelen kan ikke være større enn den totale prosent av hvert enkelt materiale!\",\"\"))","v":""},null,null,null,null,null,null,null,null,null,null,null,null,1,{"$f":"1","v":1}]
[null,null,{"$f":"IF(G526=\"\",\"\",IF(SUM(G528:G535)=0,\"\",IF(U526=1,IF(U526+L536=1,\"REGISTRER DET TOTALE VOLUMET AV RELEVANTE MATERIALER\",IF((U526+G536+L536)=1,\"REGISTRER DET TOTALE VOLUMET AV RELEVANTE MATERIALER\",IF(ISERROR(C537),\"REGISTRER DET TOTALE VOLUMET AV RELEVANTE MATERIALER\",IF(OR(G528>L536,G529>L536,G530>L536,G531>L536,G532>L536,G533>L536,G534>L536,G535>L536),\"Volumet av de enkelte materialer kan ikke overstige mengden relevante materialer\",IF(SUM(G528:G535)>L536,\"Den totale mengden av materialer kan ikke overstige det  totale volumet av relevante materialer\",\"\"))))),IF(U526=2,IF(SUM(G528:G535)<80,\"Minst 80 % av de relevante materialer må vurderes, vennligst beregn på nytt.\",IF(OR(G528>100,G529>100,G530>100,G531>100,G532>100,G533>100,G534>100,G535>100),\"Prosentandel av de enkelte materialerer kan ikke overstige 100\",IF(SUM(G528:G535)>100,\"Den totale prosentandelen av materialer kan ikke overstige 100\",\"\")))))))","v":""},null,"Mat. 1",null,null,null,null,null,null,null,{"$f":"IF(SUM(H544+I544+J544+K544+L544)>=3,\"3,00\",SUM(H544+I544+J544+K544+L544))","v":0},{"$f":"IF(AND(U526=1,L536=\"\"),0,IF(OR(NOT(D527=\"\"),NOT(C528=\"\"),NOT(N529=\"\")),0,IF(ISERROR(N537),\"0\",N537)))","v":0},null,{"$f":"IF(SUM(H528:L528)>G528,\"1\",\"0\")","v":"0"},1,{"$f":"1","v":1}]
[null,null,null,null,"Mat. 2",null,null,null,null,null,null,null,null,{"$f":"IF(AND(U526=1,L536=\"\"),C528,+IF(G537>L536,C528,(IF(N537<80,\"Ingen poeng oppnådd,\nmindre enn 80 % oppfyller kravet\",\"\"))))","v":""},null,{"$f":"IF(SUM(H529:L529)>G529,\"1\",\"0\")","v":"0"},1,{"$f":"1","v":1}]
[null,null,null,null,"Mat. 3",null,null,null,null,null,null,null,null,null,null,"0",1,{"$f":"1","v":1}]
[null,null,null,null,"Mat. 4",null,null,null,null,null,null,null,null,null,null,"0",1,{"$f":"1","v":1}]
[null,null,null,null,"Mat. 5",null,null,null,null,null,null,null,null,null,null,"0",1,{"$f":"1","v":1}]
[null,null,null,null,"Mat. 6",null,null,null,null,null,null,null,null,null,null,"0",1,{"$f":"1","v":1}]
[null,null,null,null,"Mat. 7",null,null,null,null,null,null,null,null,null,null,"0",1,{"$f":"1","v":1}]
[null,null,null,null,"Mat. 8",null,null,null,null,null,null,null,null,null,null,"0",1,{"$f":"1","v":1}]
[null,null,null,null,"Totalt % av bygningselementet (relevante materialer) vurdert:",null,{"$f":"IF(U526=\"\",0,IF(U526+L536=1,0,IF(SUM(G528:G535)=0,0,IF(U526=1,IF(OR(G528>L536,G529>L536,G530>L536,G531>L536,G532>L536,G533>L536,G534>L536,G535>L536,SUM(G528:G535)>L536),0,((SUM(G528:G535)/L536)*100)),IF(U526=2,IF(OR(G528>100,G529>100,G530>100,G531>100,G532>100,G533>100,G534>100,G535>100,SUM(G528:G535)>100),0,SUM(G528:G535)))))))","v":0},"Samlet volum for aktuelle elementer:",null,null,null,null,null,null,null,null,1,{"$f":"1","v":1}]
[null,null,{"$f":"IF(G536=0,\"0\",IF(U526=2,\"0\",IF(U526=1,(G536/100)*100,IF(U526=2,(G536/100)*100))))","v":"0"},{"$f":"G536","v":0},null,"Total",{"$f":"IF(SUM(G528:G535)=0,\"1\",SUM(G528:G535))","v":"1"},{"$f":"SUM(H528:H535)","v":0},{"$f":"SUM(I528:I535)","v":0},{"$f":"SUM(J528:J535)","v":0},{"$f":"SUM(K528:K535)","v":0},{"$f":"SUM(L528:L535)","v":0},null,{"$f":"SUM(H538:L538)","v":0},{"$f":"IF(G536<80,\"0,00\",IF(P537>0,\"0\",IF(G536>100,\"0,00\",IF(N528>=80,M528,IF(N528<80,0)))))","v":"0,00"},{"$f":"P528+P529+P530+P531+P532+P533+P534+P535","v":0},{"$f":"1","v":1},{"$f":"1","v":1}]
[null,null,null,null,null,null,"Percentage",{"$f":"IF(H537+G537=0,\"0\",(H537/G537)*100)","v":0},{"$f":"IF(I537+G537=0,\"0\",(I537/G537)*100)","v":0},{"$f":"IF(J537+G537=0,\"0\",(J537/G537)*100)","v":0},{"$f":"IF(K537+G537=0,\"0\",(K537/G537)*100)","v":0},{"$f":"IF(L537+G537=0,\"0\",(L537/G537)*100)","v":0},null,100,null,null,{"$f":"1","v":1},{"$f":"1","v":1}]
[null,null,null,null,null,{"$f":"IF(U526=1,((G537/100)*80))","v":false},"% of 80",{"$f":"(H538/80)*100","v":0},{"$f":"(I538/80)*100","v":0},{"$f":"(J538/80)*100","v":0},{"$f":"(K538/80)*100","v":0},{"$f":"(L538/80)*100","v":0},null,null,null,null,{"$f":"1","v":1},{"$f":"1","v":1}]
[null,null,null,null,null,null,"Limiter",{"$f":"IF(H539>100,\"100\",H539)","v":0},{"$f":"IF(I539>100,\"100\",I539)","v":0},{"$f":"IF(J539>100,\"100\",J539)","v":0},{"$f":"IF(K539>100,\"100\",K539)","v":0},{"$f":"IF(L539>100,\"100\",L539)","v":0},null,null,null,null,{"$f":"1","v":1},{"$f":"1","v":1}]
[null,null,null,null,null,null,null,null,{"$f":"IF(H540+I540+J540+K540+L540=0,0,100-(H540))","v":0},{"$f":"IF(H540+I540+J540+K540+L540=0,0,100-(H540+I540))","v":0},{"$f":"IF(J540+I540+H540+K540+L540=0,0,100-(J540+I540+H540))","v":0},{"$f":"IF(K540+J540+I540+H540+L540=0,0,100-(H540+I540+K540+J540))","v":0},null,null,null,null,{"$f":"1","v":1},{"$f":"1","v":1}]
[null,null,null,null,null,null,null,null,{"$f":"IF(I540>I541,I541,I540)","v":0},{"$f":"IF(J540>J541,J541,J540)","v":0},{"$f":"IF(K540>K541,K541,K540)","v":0},{"$f":"IF(L540>L541,L541,L540)","v":0},null,null,null,null,{"$f":"1","v":1},{"$f":"1","v":1}]
[null,null,null,null,null,null,null,null,null,null,null,{"$f":"IF(K542+J540+H540+I540>=100,0,L542)","v":0},null,null,null,null,{"$f":"1","v":1},{"$f":"1","v":1}]
[null,null,null,null,null,null,"Scores",{"$f":"IF(H537=0,0,0.01*(H540*H545))","v":0},{"$f":"IF(I537=0,0,0.01*(I542*I545))","v":0},{"$f":"IF(J537=0,0,0.01*(J542*J545))","v":0},{"$f":"IF(K537=0,0,0.01*(K542*K545))","v":0},{"$f":"IF(L537=0,0,0.01*(L543*L545))","v":0},null,null,null,null,{"$f":"1","v":1},{"$f":"1","v":1}]
[null,null,null,null,null,null,null,3,2.5,2,1.5,1,"Total",null,null,null,{"$f":"1","v":1},{"$f":"1","v":1}]
[null,null,"FUNDAMENT/GRUNNMUR (3)",null,null,"Velg datatype:",null,null,null,null,null,null,null,null,null,null,{"$f":"IF(freq7>=5,0,1)","v":1},{"$f":"1","v":1},null,null,{"$f":"IF(G546=\"\",2,IF(ISERROR(VLOOKUP(G546,$T$1246:$U$1247,2,FALSE)),\"\",VLOOKUP(G546,$T$1246:$U$1247,2,FALSE)))","v":2}]
[null,null,null,{"$f":"IF(AND(P557>=1,type1=1),\"NB! Volum av nivåene kan ikke være større enn det totale volumet for hvert enkelt materiale!\",+IF(AND(P557>=1,type1=2),\"NB! Prosentandel for hvert nivå må registreres i prosent av det vurderte bygningselementet, og den totale prosentandelen kan ikke være større enn den totale prosent av hvert enkelt materiale!\",\"\"))","v":""},null,null,null,null,null,null,null,null,null,null,null,null,1,{"$f":"1","v":1}]
[null,null,{"$f":"IF(G546=\"\",\"\",IF(SUM(G548:G555)=0,\"\",IF(U546=1,IF(U546+L556=1,\"REGISTRER DET TOTALE VOLUMET AV RELEVANTE MATERIALER\",IF((U546+G556+L556)=1,\"REGISTRER DET TOTALE VOLUMET AV RELEVANTE MATERIALER\",IF(ISERROR(C557),\"REGISTRER DET TOTALE VOLUMET AV RELEVANTE MATERIALER\",IF(OR(G548>L556,G549>L556,G550>L556,G551>L556,G552>L556,G553>L556,G554>L556,G555>L556),\"Volumet av de enkelte materialer kan ikke overstige mengden relevante materialer\",IF(SUM(G548:G555)>L556,\"Den totale mengden av materialer kan ikke overstige det  totale volumet av relevante materialer\",\"\"))))),IF(U546=2,IF(SUM(G548:G555)<80,\"Minst 80 % av de relevante materialer må vurderes, vennligst beregn på nytt.\",IF(OR(G548>100,G549>100,G550>100,G551>100,G552>100,G553>100,G554>100,G555>100),\"Prosentandel av de enkelte materialerer kan ikke overstige 100\",IF(SUM(G548:G555)>100,\"Den totale prosentandelen av materialer kan ikke overstige 100\",\"\")))))))","v":""},null,"Mat. 1",null,null,null,null,null,null,null,{"$f":"IF(SUM(H564+I564+J564+K564+L564)>=3,\"3,00\",SUM(H564+I564+J564+K564+L564))","v":0},{"$f":"IF(AND(U546=1,L556=\"\"),0,IF(OR(NOT(D547=\"\"),NOT(C548=\"\"),NOT(N549=\"\")),0,IF(ISERROR(N557),\"0\",N557)))","v":0},null,{"$f":"IF(SUM(H548:L548)>G548,\"1\",\"0\")","v":"0"},1,{"$f":"1","v":1}]
[null,null,null,null,"Mat. 2",null,null,null,null,null,null,null,null,{"$f":"IF(AND(U546=1,L556=\"\"),C548,+IF(G557>L556,C548,(IF(N557<80,\"Ingen poeng oppnådd,\nmindre enn 80 % oppfyller kravet\",\"\"))))","v":""},null,{"$f":"IF(SUM(H549:L549)>G549,\"1\",\"0\")","v":"0"},1,{"$f":"1","v":1}]
[null,null,null,null,"Mat. 3",null,null,null,null,null,null,null,null,null,null,"0",1,{"$f":"1","v":1}]
[null,null,null,null,"Mat. 4",null,null,null,null,null,null,null,null,null,null,"0",1,{"$f":"1","v":1}]
[null,null,null,null,"Mat. 5",null,null,null,null,null,null,null,null,null,null,"0",1,{"$f":"1","v":1}]
[null,null,null,null,"Mat. 6",null,null,null,null,null,null,null,null,null,null,"0",1,{"$f":"1","v":1}]
[null,null,null,null,"Mat. 7",null,null,null,null,null,null,null,null,null,null,"0",1,{"$f":"1","v":1}]
[null,null,null,null,"Mat. 8",null,null,null,null,null,null,null,null,null,null,"0",1,{"$f":"1","v":1}]
[null,null,null,null,"Totalt % av bygningselementet (relevante materialer) vurdert:",null,{"$f":"IF(U546=\"\",0,IF(U546+L556=1,0,IF(SUM(G548:G555)=0,0,IF(U546=1,IF(OR(G548>L556,G549>L556,G550>L556,G551>L556,G552>L556,G553>L556,G554>L556,G555>L556,SUM(G548:G555)>L556),0,((SUM(G548:G555)/L556)*100)),IF(U546=2,IF(OR(G548>100,G549>100,G550>100,G551>100,G552>100,G553>100,G554>100,G555>100,SUM(G548:G555)>100),0,SUM(G548:G555)))))))","v":0},"Samlet volum for aktuelle elementer:",null,null,null,null,null,null,null,null,1,{"$f":"1","v":1}]
[null,null,{"$f":"IF(G556=0,\"0\",IF(U546=2,\"0\",IF(U546=1,(G556/100)*100,IF(U546=2,(G556/100)*100))))","v":"0"},{"$f":"G556","v":0},null,"Total",{"$f":"IF(SUM(G548:G555)=0,\"1\",SUM(G548:G555))","v":"1"},{"$f":"SUM(H548:H555)","v":0},{"$f":"SUM(I548:I555)","v":0},{"$f":"SUM(J548:J555)","v":0},{"$f":"SUM(K548:K555)","v":0},{"$f":"SUM(L548:L555)","v":0},null,{"$f":"SUM(H558:L558)","v":0},{"$f":"IF(G556<80,\"0,00\",IF(P557>0,\"0\",IF(G556>100,\"0,00\",IF(N548>=80,M548,IF(N548<80,0)))))","v":"0,00"},{"$f":"P548+P549+P550+P551+P552+P553+P554+P555","v":0},{"$f":"1","v":1},{"$f":"1","v":1}]
[null,null,null,null,null,null,"Percentage",{"$f":"IF(H557+G557=0,\"0\",(H557/G557)*100)","v":0},{"$f":"IF(I557+G557=0,\"0\",(I557/G557)*100)","v":0},{"$f":"IF(J557+G557=0,\"0\",(J557/G557)*100)","v":0},{"$f":"IF(K557+G557=0,\"0\",(K557/G557)*100)","v":0},{"$f":"IF(L557+G557=0,\"0\",(L557/G557)*100)","v":0},null,100,null,null,{"$f":"1","v":1},{"$f":"1","v":1}]
[null,null,null,null,null,{"$f":"IF(U546=1,((G557/100)*80))","v":false},"% of 80",{"$f":"(H558/80)*100","v":0},{"$f":"(I558/80)*100","v":0},{"$f":"(J558/80)*100","v":0},{"$f":"(K558/80)*100","v":0},{"$f":"(L558/80)*100","v":0},null,null,null,null,{"$f":"1","v":1},{"$f":"1","v":1}]
[null,null,null,null,null,null,"Limiter",{"$f":"IF(H559>100,\"100\",H559)","v":0},{"$f":"IF(I559>100,\"100\",I559)","v":0},{"$f":"IF(J559>100,\"100\",J559)","v":0},{"$f":"IF(K559>100,\"100\",K559)","v":0},{"$f":"IF(L559>100,\"100\",L559)","v":0},null,null,null,null,{"$f":"1","v":1},{"$f":"1","v":1}]
[null,null,null,null,null,null,null,null,{"$f":"IF(H560+I560+J560+K560+L560=0,0,100-(H560))","v":0},{"$f":"IF(H560+I560+J560+K560+L560=0,0,100-(H560+I560))","v":0},{"$f":"IF(J560+I560+H560+K560+L560=0,0,100-(J560+I560+H560))","v":0},{"$f":"IF(K560+J560+I560+H560+L560=0,0,100-(H560+I560+K560+J560))","v":0},null,null,null,null,{"$f":"1","v":1},{"$f":"1","v":1}]
[null,null,null,null,null,null,null,null,{"$f":"IF(I560>I561,I561,I560)","v":0},{"$f":"IF(J560>J561,J561,J560)","v":0},{"$f":"IF(K560>K561,K561,K560)","v":0},{"$f":"IF(L560>L561,L561,L560)","v":0},null,null,null,null,{"$f":"1","v":1},{"$f":"1","v":1}]
[null,null,null,null,null,null,null,null,null,null,null,{"$f":"IF(K562+J560+H560+I560>=100,0,L562)","v":0},null,null,null,null,{"$f":"1","v":1},{"$f":"1","v":1}]
[null,null,null,null,null,null,"Scores",{"$f":"IF(H557=0,0,0.01*(H560*H565))","v":0},{"$f":"IF(I557=0,0,0.01*(I562*I565))","v":0},{"$f":"IF(J557=0,0,0.01*(J562*J565))","v":0},{"$f":"IF(K557=0,0,0.01*(K562*K565))","v":0},{"$f":"IF(L557=0,0,0.01*(L563*L565))","v":0},null,null,null,null,{"$f":"1","v":1},{"$f":"1","v":1}]
[null,null,null,null,null,null,null,3,2.5,2,1.5,1,"Total",null,null,null,{"$f":"1","v":1},{"$f":"1","v":1}]
[null,null,"FUNDAMENT/GRUNNMUR (4)",null,null,"Velg datatype:",null,null,null,null,null,null,null,null,null,null,{"$f":"IF(freq7>=6,0,1)","v":1},{"$f":"1","v":1},null,null,{"$f":"IF(G566=\"\",2,IF(ISERROR(VLOOKUP(G566,$T$1246:$U$1247,2,FALSE)),\"\",VLOOKUP(G566,$T$1246:$U$1247,2,FALSE)))","v":2}]
[null,null,null,{"$f":"IF(AND(P577>=1,type1=1),\"NB! Volum av nivåene kan ikke være større enn det totale volumet for hvert enkelt materiale!\",+IF(AND(P577>=1,type1=2),\"NB! Prosentandel for hvert nivå må registreres i prosent av det vurderte bygningselementet, og den totale prosentandelen kan ikke være større enn den totale prosent av hvert enkelt materiale!\",\"\"))","v":""},null,null,null,null,null,null,null,null,null,null,null,null,1,{"$f":"1","v":1}]
[null,null,{"$f":"IF(G566=\"\",\"\",IF(SUM(G568:G575)=0,\"\",IF(U566=1,IF(U566+L576=1,\"REGISTRER DET TOTALE VOLUMET AV RELEVANTE MATERIALER\",IF((U566+G576+L576)=1,\"REGISTRER DET TOTALE VOLUMET AV RELEVANTE MATERIALER\",IF(ISERROR(C577),\"REGISTRER DET TOTALE VOLUMET AV RELEVANTE MATERIALER\",IF(OR(G568>L576,G569>L576,G570>L576,G571>L576,G572>L576,G573>L576,G574>L576,G575>L576),\"Volumet av de enkelte materialer kan ikke overstige mengden relevante materialer\",IF(SUM(G568:G575)>L576,\"Den totale mengden av materialer kan ikke overstige det  totale volumet av relevante materialer\",\"\"))))),IF(U566=2,IF(SUM(G568:G575)<80,\"Minst 80 % av de relevante materialer må vurderes, vennligst beregn på nytt.\",IF(OR(G568>100,G569>100,G570>100,G571>100,G572>100,G573>100,G574>100,G575>100),\"Prosentandel av de enkelte materialerer kan ikke overstige 100\",IF(SUM(G568:G575)>100,\"Den totale prosentandelen av materialer kan ikke overstige 100\",\"\")))))))","v":""},null,"Mat. 1",null,null,null,null,null,null,null,{"$f":"IF(SUM(H584+I584+J584+K584+L584)>=3,\"3,00\",SUM(H584+I584+J584+K584+L584))","v":0},{"$f":"IF(AND(U566=1,L576=\"\"),0,IF(OR(NOT(D567=\"\"),NOT(C568=\"\"),NOT(N569=\"\")),0,IF(ISERROR(N577),\"0\",N577)))","v":0},null,{"$f":"IF(SUM(H568:L568)>G568,\"1\",\"0\")","v":"0"},1,{"$f":"1","v":1}]
[null,null,null,null,"Mat. 2",null,null,null,null,null,null,null,null,{"$f":"IF(AND(U566=1,L576=\"\"),C568,+IF(G577>L576,C568,(IF(N577<80,\"Ingen poeng oppnådd,\nmindre enn 80 % oppfyller kravet\",\"\"))))","v":""},null,{"$f":"IF(SUM(H569:L569)>G569,\"1\",\"0\")","v":"0"},1,{"$f":"1","v":1}]
[null,null,null,null,"Mat. 3",null,null,null,null,null,null,null,null,null,null,"0",1,{"$f":"1","v":1}]
[null,null,null,null,"Mat. 4",null,null,null,null,null,null,null,null,null,null,"0",1,{"$f":"1","v":1}]
[null,null,null,null,"Mat. 5",null,null,null,null,null,null,null,null,null,null,"0",1,{"$f":"1","v":1}]
[null,null,null,null,"Mat. 6",null,null,null,null,null,null,null,null,null,null,"0",1,{"$f":"1","v":1}]
[null,null,null,null,"Mat. 7",null,null,null,null,null,null,null,null,null,null,"0",1,{"$f":"1","v":1}]
[null,null,null,null,"Mat. 8",null,null,null,null,null,null,null,null,null,null,"0",1,{"$f":"1","v":1}]
[null,null,null,null,"Totalt % av bygningselementet (relevante materialer) vurdert:",null,{"$f":"IF(U566=\"\",0,IF(U566+L576=1,0,IF(SUM(G568:G575)=0,0,IF(U566=1,IF(OR(G568>L576,G569>L576,G570>L576,G571>L576,G572>L576,G573>L576,G574>L576,G575>L576,SUM(G568:G575)>L576),0,((SUM(G568:G575)/L576)*100)),IF(U566=2,IF(OR(G568>100,G569>100,G570>100,G571>100,G572>100,G573>100,G574>100,G575>100,SUM(G568:G575)>100),0,SUM(G568:G575)))))))","v":0},"Samlet volum for aktuelle elementer:",null,null,null,null,null,null,null,null,1,{"$f":"1","v":1}]
[null,null,{"$f":"IF(G576=0,\"0\",IF(U566=2,\"0\",IF(U566=1,(G576/100)*100,IF(U566=2,(G576/100)*100))))","v":"0"},{"$f":"G576","v":0},null,"Total",{"$f":"IF(SUM(G568:G575)=0,\"1\",SUM(G568:G575))","v":"1"},{"$f":"SUM(H568:H575)","v":0},{"$f":"SUM(I568:I575)","v":0},{"$f":"SUM(J568:J575)","v":0},{"$f":"SUM(K568:K575)","v":0},{"$f":"SUM(L568:L575)","v":0},null,{"$f":"SUM(H578:L578)","v":0},{"$f":"IF(G576<80,\"0,00\",IF(P577>0,\"0\",IF(G576>100,\"0,00\",IF(N568>=80,M568,IF(N568<80,0)))))","v":"0,00"},{"$f":"P568+P569+P570+P571+P572+P573+P574+P575","v":0},{"$f":"1","v":1},{"$f":"1","v":1}]
[null,null,null,null,null,null,"Percentage",{"$f":"IF(H577+G577=0,\"0\",(H577/G577)*100)","v":0},{"$f":"IF(I577+G577=0,\"0\",(I577/G577)*100)","v":0},{"$f":"IF(J577+G577=0,\"0\",(J577/G577)*100)","v":0},{"$f":"IF(K577+G577=0,\"0\",(K577/G577)*100)","v":0},{"$f":"IF(L577+G577=0,\"0\",(L577/G577)*100)","v":0},null,100,null,null,{"$f":"1","v":1},{"$f":"1","v":1}]
[null,null,null,null,null,{"$f":"IF(U566=1,((G577/100)*80))","v":false},"% of 80",{"$f":"(H578/80)*100","v":0},{"$f":"(I578/80)*100","v":0},{"$f":"(J578/80)*100","v":0},{"$f":"(K578/80)*100","v":0},{"$f":"(L578/80)*100","v":0},null,null,null,null,{"$f":"1","v":1},{"$f":"1","v":1}]
[null,null,null,null,null,null,"Limiter",{"$f":"IF(H579>100,\"100\",H579)","v":0},{"$f":"IF(I579>100,\"100\",I579)","v":0},{"$f":"IF(J579>100,\"100\",J579)","v":0},{"$f":"IF(K579>100,\"100\",K579)","v":0},{"$f":"IF(L579>100,\"100\",L579)","v":0},null,null,null,null,{"$f":"1","v":1},{"$f":"1","v":1}]
[null,null,null,null,null,null,null,null,{"$f":"IF(H580+I580+J580+K580+L580=0,0,100-(H580))","v":0},{"$f":"IF(H580+I580+J580+K580+L580=0,0,100-(H580+I580))","v":0},{"$f":"IF(J580+I580+H580+K580+L580=0,0,100-(J580+I580+H580))","v":0},{"$f":"IF(K580+J580+I580+H580+L580=0,0,100-(H580+I580+K580+J580))","v":0},null,null,null,null,{"$f":"1","v":1},{"$f":"1","v":1}]
[null,null,null,null,null,null,null,null,{"$f":"IF(I580>I581,I581,I580)","v":0},{"$f":"IF(J580>J581,J581,J580)","v":0},{"$f":"IF(K580>K581,K581,K580)","v":0},{"$f":"IF(L580>L581,L581,L580)","v":0},null,null,null,null,{"$f":"1","v":1},{"$f":"1","v":1}]
[null,null,null,null,null,null,null,null,null,null,null,{"$f":"IF(K582+J580+H580+I580>=100,0,L582)","v":0},null,null,null,null,{"$f":"1","v":1},{"$f":"1","v":1}]
[null,null,null,null,null,null,"Scores",{"$f":"IF(H577=0,0,0.01*(H580*H585))","v":0},{"$f":"IF(I577=0,0,0.01*(I582*I585))","v":0},{"$f":"IF(J577=0,0,0.01*(J582*J585))","v":0},{"$f":"IF(K577=0,0,0.01*(K582*K585))","v":0},{"$f":"IF(L577=0,0,0.01*(L583*L585))","v":0},null,null,null,null,{"$f":"1","v":1},{"$f":"1","v":1}]
[null,null,null,null,null,null,null,3,2.5,2,1.5,1,"Total",null,null,null,{"$f":"1","v":1},{"$f":"1","v":1}]
[null,null,"TRAPPEHUS",null,null,"Velg antall trappehus du ønsker å vurdere (deretter trykk «velg»):",null,null,null,null,{"$f":"IF(AND(G586=\"\",G597>0),\"NB! Husk å velge antall elementer...\",\"\")","v":""},null,null,null,{"$f":"IF(ISERROR(O598+O618+O638+O658)/V587,\"\",(O598+O618+O638+O658)/V587)","v":0},null,{"$f":"0","v":0},{"$f":"IF(asstype=3,0,IF(asstype=2,0,IF(typescheme=2,0,1)))","v":1},null,{"$f":"VLOOKUP(G586,$T$1239:$U$1243,2,FALSE)","v":2}]
[null,null,{"$f":"IF(G586=\"\",\"TRAPPEHUS\",\"TRAPPEHUS (1)\")","v":"TRAPPEHUS"},null,null,"Velg datatype:",null,null,null,null,null,null,null,null,null,null,{"$f":"IF(freq8>=3,0,1)","v":1},1,null,null,{"$f":"IF(G587=\"\",2,IF(ISERROR(VLOOKUP(G587,$T$1246:$U$1247,2,FALSE)),\"\",VLOOKUP(G587,$T$1246:$U$1247,2,FALSE)))","v":2},{"$f":"IF(freq8=3,1,IF(freq8=4,2,IF(freq8=5,3,IF(freq8=6,4,1))))","v":1}]
[null,null,null,{"$f":"IF(AND(P598>=1,type1=1),\"NB! Volum av nivåene kan ikke være større enn det totale volumet for hvert enkelt materiale!\",+IF(AND(P598>=1,type1=2),\"NB! Prosentandel for hvert nivå må registreres i prosent av det vurderte bygningselementet, og den totale prosentandelen kan ikke være større enn den totale prosent av hvert enkelt materiale!\",\"\"))","v":""},null,null,null,null,null,null,null,null,null,null,null,null,1,1]
[null,null,{"$f":"IF(G587=\"\",\"\",IF(SUM(G589:G596)=0,\"\",IF(U587=1,IF(U587+L597=1,\"REGISTRER DET TOTALE VOLUMET AV RELEVANTE MATERIALER\",IF((U587+G597+L597)=1,\"REGISTRER DET TOTALE VOLUMET AV RELEVANTE MATERIALER\",IF(ISERROR(C598),\"REGISTRER DET TOTALE VOLUMET AV RELEVANTE MATERIALER\",IF(OR(G589>L597,G590>L597,G591>L597,G592>L597,G593>L597,G594>L597,G595>L597,G596>L597),\"Volumet av de enkelte materialer kan ikke overstige mengden relevante materialer\",IF(SUM(G589:G596)>L597,\"Den totale mengden av materialer kan ikke overstige det  totale volumet av relevante materialer\",\"\"))))),IF(U587=2,IF(SUM(G589:G596)<80,\"Minst 80 % av de relevante materialer må vurderes, vennligst beregn på nytt.\",IF(OR(G589>100,G590>100,G591>100,G592>100,G593>100,G594>100,G595>100,G596>100),\"Prosentandel av de enkelte materialerer kan ikke overstige 100\",IF(SUM(G589:G596)>100,\"Den totale prosentandelen av materialer kan ikke overstige 100\",\"\")))))))","v":""},null,"Mat. 1",null,null,null,null,null,null,null,{"$f":"IF(SUM(H605+I605+J605+K605+L605)>=3,\"3,00\",SUM(H605+I605+J605+K605+L605))","v":0},{"$f":"IF(AND(U587=1,L597=\"\"),0,IF(OR(NOT(D588=\"\"),NOT(C589=\"\"),NOT(N590=\"\")),0,IF(ISERROR(N598),\"0\",N598)))","v":0},null,{"$f":"IF(SUM(H589:L589)>G589,\"1\",\"0\")","v":"0"},1,1]
[null,null,null,null,"Mat. 2",null,null,null,null,null,null,null,null,{"$f":"IF(AND(U587=1,L597=\"\"),C589,+IF(G598>L597,C589,(IF(N598<80,\"Ingen poeng oppnådd,\nmindre enn 80 % oppfyller kravet\",\"\"))))","v":""},null,{"$f":"IF(SUM(H590:L590)>G590,\"1\",\"0\")","v":"0"},1,1]
[null,null,null,null,"Mat. 3",null,null,null,null,null,null,null,null,null,null,"0",1,1]
[null,null,null,null,"Mat. 4",null,null,null,null,null,null,null,null,null,null,"0",{"$f":"IF(freq8>=3,0,1)","v":1},1]
[null,null,null,null,"Mat. 5",null,null,null,null,null,null,null,null,null,null,"0",1,1]
[null,null,null,null,"Mat. 6",null,null,null,null,null,null,null,null,null,null,"0",1,1]
[null,null,null,null,"Mat. 7",null,null,null,null,null,null,null,null,null,null,"0",1,1]
[null,null,null,null,"Mat. 8",null,null,null,null,null,null,null,null,null,null,"0",1,1]
[null,null,null,null,"Totalt % av bygningselementet (relevante materialer) vurdert:",null,{"$f":"IF(U587=\"\",0,IF(U587+L597=1,0,IF(SUM(G589:G596)=0,0,IF(U587=1,IF(OR(G589>L597,G590>L597,G591>L597,G592>L597,G593>L597,G594>L597,G595>L597,G596>L597,SUM(G589:G596)>L597),0,((SUM(G589:G596)/L597)*100)),IF(U587=2,IF(OR(G589>100,G590>100,G591>100,G592>100,G593>100,G594>100,G595>100,G596>100,SUM(G589:G596)>100),0,SUM(G589:G596)))))))","v":0},"Samlet volum for aktuelle elementer:",null,null,null,null,null,null,null,null,1,1]
[null,null,{"$f":"IF(G597=0,\"0\",IF(U590=2,\"0\",IF(U590=1,(G597/100)*100,IF(U590=2,(G597/100)*100))))","v":"0"},{"$f":"G597","v":0},null,"Total",{"$f":"IF(SUM(G589:G596)=0,\"1\",SUM(G589:G596))","v":"1"},{"$f":"SUM(H589:H596)","v":0},{"$f":"SUM(I589:I596)","v":0},{"$f":"SUM(J589:J596)","v":0},{"$f":"SUM(K589:K596)","v":0},{"$f":"SUM(L589:L596)","v":0},null,{"$f":"SUM(H599:L599)","v":0},{"$f":"IF(G597<80,\"0,00\",IF(P598>0,\"0\",IF(G597>100,\"0,00\",IF(N589>=80,M589,IF(N589<80,0)))))","v":"0,00"},{"$f":"P589+P590+P591+P592+P593+P594+P595+P596","v":0},{"$f":"1","v":1},{"$f":"1","v":1}]
[null,null,null,null,null,null,"Percentage",{"$f":"IF(H598+G598=0,\"0\",(H598/G598)*100)","v":0},{"$f":"IF(I598+G598=0,\"0\",(I598/G598)*100)","v":0},{"$f":"IF(J598+G598=0,\"0\",(J598/G598)*100)","v":0},{"$f":"IF(K598+G598=0,\"0\",(K598/G598)*100)","v":0},{"$f":"IF(L598+G598=0,\"0\",(L598/G598)*100)","v":0},null,100,null,null,{"$f":"1","v":1},{"$f":"1","v":1}]
[null,null,null,null,null,{"$f":"IF(U590=1,((G598/100)*80))","v":false},"% of 80",{"$f":"(H599/80)*100","v":0},{"$f":"(I599/80)*100","v":0},{"$f":"(J599/80)*100","v":0},{"$f":"(K599/80)*100","v":0},{"$f":"(L599/80)*100","v":0},null,null,null,null,{"$f":"1","v":1},{"$f":"1","v":1}]
[null,null,null,null,null,null,"Limiter",{"$f":"IF(H600>100,\"100\",H600)","v":0},{"$f":"IF(I600>100,\"100\",I600)","v":0},{"$f":"IF(J600>100,\"100\",J600)","v":0},{"$f":"IF(K600>100,\"100\",K600)","v":0},{"$f":"IF(L600>100,\"100\",L600)","v":0},null,null,null,null,{"$f":"1","v":1},{"$f":"1","v":1}]
[null,null,null,null,null,null,null,null,{"$f":"IF(H601+I601+J601+K601+L601=0,0,100-(H601))","v":0},{"$f":"IF(H601+I601+J601+K601+L601=0,0,100-(H601+I601))","v":0},{"$f":"IF(J601+I601+H601+K601+L601=0,0,100-(J601+I601+H601))","v":0},{"$f":"IF(K601+J601+I601+H601+L601=0,0,100-(H601+I601+K601+J601))","v":0},null,null,null,null,{"$f":"1","v":1},{"$f":"1","v":1}]
[null,null,null,null,null,null,null,null,{"$f":"IF(I601>I602,I602,I601)","v":0},{"$f":"IF(J601>J602,J602,J601)","v":0},{"$f":"IF(K601>K602,K602,K601)","v":0},{"$f":"IF(L601>L602,L602,L601)","v":0},null,null,null,null,{"$f":"1","v":1},{"$f":"1","v":1}]
[null,null,null,null,null,null,null,null,null,null,null,{"$f":"IF(K603+J601+H601+I601>=100,0,L603)","v":0},null,null,null,null,{"$f":"1","v":1},{"$f":"1","v":1}]
[null,null,null,null,null,null,"Scores",{"$f":"IF(H598=0,0,0.01*(H601*H606))","v":0},{"$f":"IF(I598=0,0,0.01*(I603*I606))","v":0},{"$f":"IF(J598=0,0,0.01*(J603*J606))","v":0},{"$f":"IF(K598=0,0,0.01*(K603*K606))","v":0},{"$f":"IF(L598=0,0,0.01*(L604*L606))","v":0},null,null,null,null,{"$f":"1","v":1},{"$f":"1","v":1}]
[null,null,null,null,null,null,null,3,2.5,2,1.5,1,"Total",null,null,null,{"$f":"1","v":1},{"$f":"1","v":1}]
[null,null,"TRAPPEHUS (2)",null,null,"Velg datatype:",null,null,null,null,null,null,null,null,null,null,{"$f":"IF(freq8>=4,0,1)","v":1},{"$f":"1","v":1},null,null,{"$f":"IF(G607=\"\",2,IF(ISERROR(VLOOKUP(G607,$T$1246:$U$1247,2,FALSE)),\"\",VLOOKUP(G607,$T$1246:$U$1247,2,FALSE)))","v":2}]
[null,null,null,{"$f":"IF(AND(P618>=1,type1=1),\"NB! Volum av nivåene kan ikke være større enn det totale volumet for hvert enkelt materiale!\",+IF(AND(P618>=1,type1=2),\"NB! Prosentandel for hvert nivå må registreres i prosent av det vurderte bygningselementet, og den totale prosentandelen kan ikke være større enn den totale prosent av hvert enkelt materiale!\",\"\"))","v":""},null,null,null,null,null,null,null,null,null,null,null,null,1,{"$f":"1","v":1}]
[null,null,{"$f":"IF(G607=\"\",\"\",IF(SUM(G609:G616)=0,\"\",IF(U607=1,IF(U607+L617=1,\"REGISTRER DET TOTALE VOLUMET AV RELEVANTE MATERIALER\",IF((U607+G617+L617)=1,\"REGISTRER DET TOTALE VOLUMET AV RELEVANTE MATERIALER\",IF(ISERROR(C618),\"REGISTRER DET TOTALE VOLUMET AV RELEVANTE MATERIALER\",IF(OR(G609>L617,G610>L617,G611>L617,G612>L617,G613>L617,G614>L617,G615>L617,G616>L617),\"Volumet av de enkelte materialer kan ikke overstige mengden relevante materialer\",IF(SUM(G609:G616)>L617,\"Den totale mengden av materialer kan ikke overstige det  totale volumet av relevante materialer\",\"\"))))),IF(U607=2,IF(SUM(G609:G616)<80,\"Minst 80 % av de relevante materialer må vurderes, vennligst beregn på nytt.\",IF(OR(G609>100,G610>100,G611>100,G612>100,G613>100,G614>100,G615>100,G616>100),\"Prosentandel av de enkelte materialerer kan ikke overstige 100\",IF(SUM(G609:G616)>100,\"Den totale prosentandelen av materialer kan ikke overstige 100\",\"\")))))))","v":""},null,"Mat. 1",null,null,null,null,null,null,null,{"$f":"IF(SUM(H625+I625+J625+K625+L625)>=3,\"3,00\",SUM(H625+I625+J625+K625+L625))","v":0},{"$f":"IF(AND(U607=1,L617=\"\"),0,IF(OR(NOT(D608=\"\"),NOT(C609=\"\"),NOT(N610=\"\")),0,IF(ISERROR(N618),\"0\",N618)))","v":0},null,{"$f":"IF(SUM(H609:L609)>G609,\"1\",\"0\")","v":"0"},1,{"$f":"1","v":1}]
[null,null,null,null,"Mat. 2",null,null,null,null,null,null,null,null,{"$f":"IF(AND(U607=1,L617=\"\"),C609,+IF(G618>L617,C609,(IF(N618<80,\"Ingen poeng oppnådd,\nmindre enn 80 % oppfyller kravet\",\"\"))))","v":""},null,{"$f":"IF(SUM(H610:L610)>G610,\"1\",\"0\")","v":"0"},1,{"$f":"1","v":1}]
[null,null,null,null,"Mat. 3",null,null,null,null,null,null,null,null,null,null,"0",1,{"$f":"1","v":1}]
[null,null,null,null,"Mat. 4",null,null,null,null,null,null,null,null,null,null,"0",1,{"$f":"1","v":1}]
[null,null,null,null,"Mat. 5",null,null,null,null,null,null,null,null,null,null,"0",1,{"$f":"1","v":1}]
[null,null,null,null,"Mat. 6",null,null,null,null,null,null,null,null,null,null,"0",1,{"$f":"1","v":1}]
[null,null,null,null,"Mat. 7",null,null,null,null,null,null,null,null,null,null,"0",1,{"$f":"1","v":1}]
[null,null,null,null,"Mat. 8",null,null,null,null,null,null,null,null,null,null,"0",1,{"$f":"1","v":1}]
[null,null,null,null,"Totalt % av bygningselementet (relevante materialer) vurdert:",null,{"$f":"IF(U607=\"\",0,IF(U607+L617=1,0,IF(SUM(G609:G616)=0,0,IF(U607=1,IF(OR(G609>L617,G610>L617,G611>L617,G612>L617,G613>L617,G614>L617,G615>L617,G616>L617,SUM(G609:G616)>L617),0,((SUM(G609:G616)/L617)*100)),IF(U607=2,IF(OR(G609>100,G610>100,G611>100,G612>100,G613>100,G614>100,G615>100,G616>100,SUM(G609:G616)>100),0,SUM(G609:G616)))))))","v":0},"Samlet volum for aktuelle elementer:",null,null,null,null,null,null,null,null,1,{"$f":"1","v":1}]
[null,null,{"$f":"IF(G617=0,\"0\",IF(U607=2,\"0\",IF(U607=1,(G617/100)*100,IF(U607=2,(G617/100)*100))))","v":"0"},{"$f":"G617","v":0},null,"Total",{"$f":"IF(SUM(G609:G616)=0,\"1\",SUM(G609:G616))","v":"1"},{"$f":"SUM(H609:H616)","v":0},{"$f":"SUM(I609:I616)","v":0},{"$f":"SUM(J609:J616)","v":0},{"$f":"SUM(K609:K616)","v":0},{"$f":"SUM(L609:L616)","v":0},null,{"$f":"SUM(H619:L619)","v":0},{"$f":"IF(G617<80,\"0,00\",IF(P618>0,\"0\",IF(G617>100,\"0,00\",IF(N609>=80,M609,IF(N609<80,0)))))","v":"0,00"},{"$f":"P609+P610+P611+P612+P613+P614+P615+P616","v":0},{"$f":"1","v":1},{"$f":"1","v":1}]
[null,null,null,null,null,null,"Percentage",{"$f":"IF(H618+G618=0,\"0\",(H618/G618)*100)","v":0},{"$f":"IF(I618+G618=0,\"0\",(I618/G618)*100)","v":0},{"$f":"IF(J618+G618=0,\"0\",(J618/G618)*100)","v":0},{"$f":"IF(K618+G618=0,\"0\",(K618/G618)*100)","v":0},{"$f":"IF(L618+G618=0,\"0\",(L618/G618)*100)","v":0},null,100,null,null,{"$f":"1","v":1},{"$f":"1","v":1}]
[null,null,null,null,null,{"$f":"IF(U607=1,((G618/100)*80))","v":false},"% of 80",{"$f":"(H619/80)*100","v":0},{"$f":"(I619/80)*100","v":0},{"$f":"(J619/80)*100","v":0},{"$f":"(K619/80)*100","v":0},{"$f":"(L619/80)*100","v":0},null,null,null,null,{"$f":"1","v":1},{"$f":"1","v":1}]
[null,null,null,null,null,null,"Limiter",{"$f":"IF(H620>100,\"100\",H620)","v":0},{"$f":"IF(I620>100,\"100\",I620)","v":0},{"$f":"IF(J620>100,\"100\",J620)","v":0},{"$f":"IF(K620>100,\"100\",K620)","v":0},{"$f":"IF(L620>100,\"100\",L620)","v":0},null,null,null,null,{"$f":"1","v":1},{"$f":"1","v":1}]
[null,null,null,null,null,null,null,null,{"$f":"IF(H621+I621+J621+K621+L621=0,0,100-(H621))","v":0},{"$f":"IF(H621+I621+J621+K621+L621=0,0,100-(H621+I621))","v":0},{"$f":"IF(J621+I621+H621+K621+L621=0,0,100-(J621+I621+H621))","v":0},{"$f":"IF(K621+J621+I621+H621+L621=0,0,100-(H621+I621+K621+J621))","v":0},null,null,null,null,{"$f":"1","v":1},{"$f":"1","v":1}]
[null,null,null,null,null,null,null,null,{"$f":"IF(I621>I622,I622,I621)","v":0},{"$f":"IF(J621>J622,J622,J621)","v":0},{"$f":"IF(K621>K622,K622,K621)","v":0},{"$f":"IF(L621>L622,L622,L621)","v":0},null,null,null,null,{"$f":"1","v":1},{"$f":"1","v":1}]
[null,null,null,null,null,null,null,null,null,null,null,{"$f":"IF(K623+J621+H621+I621>=100,0,L623)","v":0},null,null,null,null,{"$f":"1","v":1},{"$f":"1","v":1}]
[null,null,null,null,null,null,"Scores",{"$f":"IF(H618=0,0,0.01*(H621*H626))","v":0},{"$f":"IF(I618=0,0,0.01*(I623*I626))","v":0},{"$f":"IF(J618=0,0,0.01*(J623*J626))","v":0},{"$f":"IF(K618=0,0,0.01*(K623*K626))","v":0},{"$f":"IF(L618=0,0,0.01*(L624*L626))","v":0},null,null,null,null,{"$f":"1","v":1},{"$f":"1","v":1}]
[null,null,null,null,null,null,null,3,2.5,2,1.5,1,"Total",null,null,null,{"$f":"1","v":1},{"$f":"1","v":1}]
[null,null,"TRAPPEHUS (3)",null,null,"Velg datatype:",null,null,null,null,null,null,null,null,null,null,{"$f":"IF(freq8>=5,0,1)","v":1},{"$f":"1","v":1},null,null,{"$f":"IF(G627=\"\",2,IF(ISERROR(VLOOKUP(G627,$T$1246:$U$1247,2,FALSE)),\"\",VLOOKUP(G627,$T$1246:$U$1247,2,FALSE)))","v":2}]
[null,null,null,{"$f":"IF(AND(P638>=1,type1=1),\"NB! Volum av nivåene kan ikke være større enn det totale volumet for hvert enkelt materiale!\",+IF(AND(P638>=1,type1=2),\"NB! Prosentandel for hvert nivå må registreres i prosent av det vurderte bygningselementet, og den totale prosentandelen kan ikke være større enn den totale prosent av hvert enkelt materiale!\",\"\"))","v":""},null,null,null,null,null,null,null,null,null,null,null,null,1,{"$f":"1","v":1}]
[null,null,{"$f":"IF(G627=\"\",\"\",IF(SUM(G629:G636)=0,\"\",IF(U627=1,IF(U627+L637=1,\"REGISTRER DET TOTALE VOLUMET AV RELEVANTE MATERIALER\",IF((U627+G637+L637)=1,\"REGISTRER DET TOTALE VOLUMET AV RELEVANTE MATERIALER\",IF(ISERROR(C638),\"REGISTRER DET TOTALE VOLUMET AV RELEVANTE MATERIALER\",IF(OR(G629>L637,G630>L637,G631>L637,G632>L637,G633>L637,G634>L637,G635>L637,G636>L637),\"Volumet av de enkelte materialer kan ikke overstige mengden relevante materialer\",IF(SUM(G629:G636)>L637,\"Den totale mengden av materialer kan ikke overstige det  totale volumet av relevante materialer\",\"\"))))),IF(U627=2,IF(SUM(G629:G636)<80,\"Minst 80 % av de relevante materialer må vurderes, vennligst beregn på nytt.\",IF(OR(G629>100,G630>100,G631>100,G632>100,G633>100,G634>100,G635>100,G636>100),\"Prosentandel av de enkelte materialerer kan ikke overstige 100\",IF(SUM(G629:G636)>100,\"Den totale prosentandelen av materialer kan ikke overstige 100\",\"\")))))))","v":""},null,"Mat. 1",null,null,null,null,null,null,null,{"$f":"IF(SUM(H645+I645+J645+K645+L645)>=3,\"3,00\",SUM(H645+I645+J645+K645+L645))","v":0},{"$f":"IF(AND(U627=1,L637=\"\"),0,IF(OR(NOT(D628=\"\"),NOT(C629=\"\"),NOT(N630=\"\")),0,IF(ISERROR(N638),\"0\",N638)))","v":0},null,{"$f":"IF(SUM(H629:L629)>G629,\"1\",\"0\")","v":"0"},1,{"$f":"1","v":1}]
[null,null,null,null,"Mat. 2",null,null,null,null,null,null,null,null,{"$f":"IF(AND(U627=1,L637=\"\"),C629,+IF(G638>L637,C629,(IF(N638<80,\"Ingen poeng oppnådd,\nmindre enn 80 % oppfyller kravet\",\"\"))))","v":""},null,{"$f":"IF(SUM(H630:L630)>G630,\"1\",\"0\")","v":"0"},1,{"$f":"1","v":1}]
[null,null,null,null,"Mat. 3",null,null,null,null,null,null,null,null,null,null,"0",1,{"$f":"1","v":1}]
[null,null,null,null,"Mat. 4",null,null,null,null,null,null,null,null,null,null,"0",1,{"$f":"1","v":1}]
[null,null,null,null,"Mat. 5",null,null,null,null,null,null,null,null,null,null,"0",1,{"$f":"1","v":1}]
[null,null,null,null,"Mat. 6",null,null,null,null,null,null,null,null,null,null,"0",1,{"$f":"1","v":1}]
[null,null,null,null,"Mat. 7",null,null,null,null,null,null,null,null,null,null,"0",1,{"$f":"1","v":1}]
[null,null,null,null,"Mat. 8",null,null,null,null,null,null,null,null,null,null,"0",1,{"$f":"1","v":1}]
[null,null,null,null,"Totalt % av bygningselementet (relevante materialer) vurdert:",null,{"$f":"IF(U627=\"\",0,IF(U627+L637=1,0,IF(SUM(G629:G636)=0,0,IF(U627=1,IF(OR(G629>L637,G630>L637,G631>L637,G632>L637,G633>L637,G634>L637,G635>L637,G636>L637,SUM(G629:G636)>L637),0,((SUM(G629:G636)/L637)*100)),IF(U627=2,IF(OR(G629>100,G630>100,G631>100,G632>100,G633>100,G634>100,G635>100,G636>100,SUM(G629:G636)>100),0,SUM(G629:G636)))))))","v":0},"Samlet volum for aktuelle elementer:",null,null,null,null,null,null,null,null,1,{"$f":"1","v":1}]
[null,null,{"$f":"IF(G637=0,\"0\",IF(U627=2,\"0\",IF(U627=1,(G637/100)*100,IF(U627=2,(G637/100)*100))))","v":"0"},{"$f":"G637","v":0},null,"Total",{"$f":"IF(SUM(G629:G636)=0,\"1\",SUM(G629:G636))","v":"1"},{"$f":"SUM(H629:H636)","v":0},{"$f":"SUM(I629:I636)","v":0},{"$f":"SUM(J629:J636)","v":0},{"$f":"SUM(K629:K636)","v":0},{"$f":"SUM(L629:L636)","v":0},null,{"$f":"SUM(H639:L639)","v":0},{"$f":"IF(G637<80,\"0,00\",IF(P638>0,\"0\",IF(G637>100,\"0,00\",IF(N629>=80,M629,IF(N629<80,0)))))","v":"0,00"},{"$f":"P629+P630+P631+P632+P633+P634+P635+P636","v":0},{"$f":"1","v":1},{"$f":"1","v":1}]
[null,null,null,null,null,null,"Percentage",{"$f":"IF(H638+G638=0,\"0\",(H638/G638)*100)","v":0},{"$f":"IF(I638+G638=0,\"0\",(I638/G638)*100)","v":0},{"$f":"IF(J638+G638=0,\"0\",(J638/G638)*100)","v":0},{"$f":"IF(K638+G638=0,\"0\",(K638/G638)*100)","v":0},{"$f":"IF(L638+G638=0,\"0\",(L638/G638)*100)","v":0},null,100,null,null,{"$f":"1","v":1},{"$f":"1","v":1}]
[null,null,null,null,null,{"$f":"IF(U627=1,((G638/100)*80))","v":false},"% of 80",{"$f":"(H639/80)*100","v":0},{"$f":"(I639/80)*100","v":0},{"$f":"(J639/80)*100","v":0},{"$f":"(K639/80)*100","v":0},{"$f":"(L639/80)*100","v":0},null,null,null,null,{"$f":"1","v":1},{"$f":"1","v":1}]
[null,null,null,null,null,null,"Limiter",{"$f":"IF(H640>100,\"100\",H640)","v":0},{"$f":"IF(I640>100,\"100\",I640)","v":0},{"$f":"IF(J640>100,\"100\",J640)","v":0},{"$f":"IF(K640>100,\"100\",K640)","v":0},{"$f":"IF(L640>100,\"100\",L640)","v":0},null,null,null,null,{"$f":"1","v":1},{"$f":"1","v":1}]
[null,null,null,null,null,null,null,null,{"$f":"IF(H641+I641+J641+K641+L641=0,0,100-(H641))","v":0},{"$f":"IF(H641+I641+J641+K641+L641=0,0,100-(H641+I641))","v":0},{"$f":"IF(J641+I641+H641+K641+L641=0,0,100-(J641+I641+H641))","v":0},{"$f":"IF(K641+J641+I641+H641+L641=0,0,100-(H641+I641+K641+J641))","v":0},null,null,null,null,{"$f":"1","v":1},{"$f":"1","v":1}]
[null,null,null,null,null,null,null,null,{"$f":"IF(I641>I642,I642,I641)","v":0},{"$f":"IF(J641>J642,J642,J641)","v":0},{"$f":"IF(K641>K642,K642,K641)","v":0},{"$f":"IF(L641>L642,L642,L641)","v":0},null,null,null,null,{"$f":"1","v":1},{"$f":"1","v":1}]
[null,null,null,null,null,null,null,null,null,null,null,{"$f":"IF(K643+J641+H641+I641>=100,0,L643)","v":0},null,null,null,null,{"$f":"1","v":1},{"$f":"1","v":1}]
[null,null,null,null,null,null,"Scores",{"$f":"IF(H638=0,0,0.01*(H641*H646))","v":0},{"$f":"IF(I638=0,0,0.01*(I643*I646))","v":0},{"$f":"IF(J638=0,0,0.01*(J643*J646))","v":0},{"$f":"IF(K638=0,0,0.01*(K643*K646))","v":0},{"$f":"IF(L638=0,0,0.01*(L644*L646))","v":0},null,null,null,null,{"$f":"1","v":1},{"$f":"1","v":1}]
[null,null,null,null,null,null,null,3,2.5,2,1.5,1,"Total",null,null,null,{"$f":"1","v":1},{"$f":"1","v":1}]
[null,null,"TRAPPEHUS (4)",null,null,"Velg datatype:",null,null,null,null,null,null,null,null,null,null,{"$f":"IF(freq8>=6,0,1)","v":1},{"$f":"1","v":1},null,null,{"$f":"IF(G647=\"\",2,IF(ISERROR(VLOOKUP(G647,$T$1246:$U$1247,2,FALSE)),\"\",VLOOKUP(G647,$T$1246:$U$1247,2,FALSE)))","v":2}]
[null,null,null,{"$f":"IF(AND(P658>=1,type1=1),\"NB! Volum av nivåene kan ikke være større enn det totale volumet for hvert enkelt materiale!\",+IF(AND(P658>=1,type1=2),\"NB! Prosentandel for hvert nivå må registreres i prosent av det vurderte bygningselementet, og den totale prosentandelen kan ikke være større enn den totale prosent av hvert enkelt materiale!\",\"\"))","v":""},null,null,null,null,null,null,null,null,null,null,null,null,1,{"$f":"1","v":1}]
[null,null,{"$f":"IF(G647=\"\",\"\",IF(SUM(G649:G656)=0,\"\",IF(U647=1,IF(U647+L657=1,\"REGISTRER DET TOTALE VOLUMET AV RELEVANTE MATERIALER\",IF((U647+G657+L657)=1,\"REGISTRER DET TOTALE VOLUMET AV RELEVANTE MATERIALER\",IF(ISERROR(C658),\"REGISTRER DET TOTALE VOLUMET AV RELEVANTE MATERIALER\",IF(OR(G649>L657,G650>L657,G651>L657,G652>L657,G653>L657,G654>L657,G655>L657,G656>L657),\"Volumet av de enkelte materialer kan ikke overstige mengden relevante materialer\",IF(SUM(G649:G656)>L657,\"Den totale mengden av materialer kan ikke overstige det  totale volumet av relevante materialer\",\"\"))))),IF(U647=2,IF(SUM(G649:G656)<80,\"Minst 80 % av de relevante materialer må vurderes, vennligst beregn på nytt.\",IF(OR(G649>100,G650>100,G651>100,G652>100,G653>100,G654>100,G655>100,G656>100),\"Prosentandel av de enkelte materialerer kan ikke overstige 100\",IF(SUM(G649:G656)>100,\"Den totale prosentandelen av materialer kan ikke overstige 100\",\"\")))))))","v":""},null,"Mat. 1",null,null,null,null,null,null,null,{"$f":"IF(SUM(H665+I665+J665+K665+L665)>=3,\"3,00\",SUM(H665+I665+J665+K665+L665))","v":0},{"$f":"IF(AND(U647=1,L657=\"\"),0,IF(OR(NOT(D648=\"\"),NOT(C649=\"\"),NOT(N650=\"\")),0,IF(ISERROR(N658),\"0\",N658)))","v":0},null,{"$f":"IF(SUM(H649:L649)>G649,\"1\",\"0\")","v":"0"},1,{"$f":"1","v":1}]
[null,null,null,null,"Mat. 2",null,null,null,null,null,null,null,null,{"$f":"IF(AND(U647=1,L657=\"\"),C649,+IF(G658>L657,C649,(IF(N658<80,\"Ingen poeng oppnådd,\nmindre enn 80 % oppfyller kravet\",\"\"))))","v":""},null,{"$f":"IF(SUM(H650:L650)>G650,\"1\",\"0\")","v":"0"},1,{"$f":"1","v":1}]
[null,null,null,null,"Mat. 3",null,null,null,null,null,null,null,null,null,null,"0",1,{"$f":"1","v":1}]
[null,null,null,null,"Mat. 4",null,null,null,null,null,null,null,null,null,null,"0",1,{"$f":"1","v":1}]
[null,null,null,null,"Mat. 5",null,null,null,null,null,null,null,null,null,null,"0",1,{"$f":"1","v":1}]
[null,null,null,null,"Mat. 6",null,null,null,null,null,null,null,null,null,null,"0",1,{"$f":"1","v":1}]
[null,null,null,null,"Mat. 7",null,null,null,null,null,null,null,null,null,null,"0",1,{"$f":"1","v":1}]
[null,null,null,null,"Mat. 8",null,null,null,null,null,null,null,null,null,null,"0",1,{"$f":"1","v":1}]
[null,null,null,null,"Totalt % av bygningselementet (relevante materialer) vurdert:",null,{"$f":"IF(U647=\"\",0,IF(U647+L657=1,0,IF(SUM(G649:G656)=0,0,IF(U647=1,IF(OR(G649>L657,G650>L657,G651>L657,G652>L657,G653>L657,G654>L657,G655>L657,G656>L657,SUM(G649:G656)>L657),0,((SUM(G649:G656)/L657)*100)),IF(U647=2,IF(OR(G649>100,G650>100,G651>100,G652>100,G653>100,G654>100,G655>100,G656>100,SUM(G649:G656)>100),0,SUM(G649:G656)))))))","v":0},"Samlet volum for aktuelle elementer:",null,null,null,null,null,null,null,null,1,{"$f":"1","v":1}]
[null,null,{"$f":"IF(G657=0,\"0\",IF(U647=2,\"0\",IF(U647=1,(G657/100)*100,IF(U647=2,(G657/100)*100))))","v":"0"},{"$f":"G657","v":0},null,"Total",{"$f":"IF(SUM(G649:G656)=0,\"1\",SUM(G649:G656))","v":"1"},{"$f":"SUM(H649:H656)","v":0},{"$f":"SUM(I649:I656)","v":0},{"$f":"SUM(J649:J656)","v":0},{"$f":"SUM(K649:K656)","v":0},{"$f":"SUM(L649:L656)","v":0},null,{"$f":"SUM(H659:L659)","v":0},{"$f":"IF(G657<80,\"0,00\",IF(P658>0,\"0\",IF(G657>100,\"0,00\",IF(N649>=80,M649,IF(N649<80,0)))))","v":"0,00"},{"$f":"P649+P650+P651+P652+P653+P654+P655+P656","v":0},{"$f":"1","v":1},{"$f":"1","v":1}]
[null,null,null,null,null,null,"Percentage",{"$f":"IF(H658+G658=0,\"0\",(H658/G658)*100)","v":0},{"$f":"IF(I658+G658=0,\"0\",(I658/G658)*100)","v":0},{"$f":"IF(J658+G658=0,\"0\",(J658/G658)*100)","v":0},{"$f":"IF(K658+G658=0,\"0\",(K658/G658)*100)","v":0},{"$f":"IF(L658+G658=0,\"0\",(L658/G658)*100)","v":0},null,100,null,null,{"$f":"1","v":1},{"$f":"1","v":1}]
[null,null,null,null,null,{"$f":"IF(U647=1,((G658/100)*80))","v":false},"% of 80",{"$f":"(H659/80)*100","v":0},{"$f":"(I659/80)*100","v":0},{"$f":"(J659/80)*100","v":0},{"$f":"(K659/80)*100","v":0},{"$f":"(L659/80)*100","v":0},null,null,null,null,{"$f":"1","v":1},{"$f":"1","v":1}]
[null,null,null,null,null,null,"Limiter",{"$f":"IF(H660>100,\"100\",H660)","v":0},{"$f":"IF(I660>100,\"100\",I660)","v":0},{"$f":"IF(J660>100,\"100\",J660)","v":0},{"$f":"IF(K660>100,\"100\",K660)","v":0},{"$f":"IF(L660>100,\"100\",L660)","v":0},null,null,null,null,{"$f":"1","v":1},{"$f":"1","v":1}]
[null,null,null,null,null,null,null,null,{"$f":"IF(H661+I661+J661+K661+L661=0,0,100-(H661))","v":0},{"$f":"IF(H661+I661+J661+K661+L661=0,0,100-(H661+I661))","v":0},{"$f":"IF(J661+I661+H661+K661+L661=0,0,100-(J661+I661+H661))","v":0},{"$f":"IF(K661+J661+I661+H661+L661=0,0,100-(H661+I661+K661+J661))","v":0},null,null,null,null,{"$f":"1","v":1},{"$f":"1","v":1}]
[null,null,null,null,null,null,null,null,{"$f":"IF(I661>I662,I662,I661)","v":0},{"$f":"IF(J661>J662,J662,J661)","v":0},{"$f":"IF(K661>K662,K662,K661)","v":0},{"$f":"IF(L661>L662,L662,L661)","v":0},null,null,null,null,{"$f":"1","v":1},{"$f":"1","v":1}]
[null,null,null,null,null,null,null,null,null,null,null,{"$f":"IF(K663+J661+H661+I661>=100,0,L663)","v":0},null,null,null,null,{"$f":"1","v":1},{"$f":"1","v":1}]
[null,null,null,null,null,null,"Scores",{"$f":"IF(H658=0,0,0.01*(H661*H666))","v":0},{"$f":"IF(I658=0,0,0.01*(I663*I666))","v":0},{"$f":"IF(J658=0,0,0.01*(J663*J666))","v":0},{"$f":"IF(K658=0,0,0.01*(K663*K666))","v":0},{"$f":"IF(L658=0,0,0.01*(L664*L666))","v":0},null,null,null,null,{"$f":"1","v":1},{"$f":"1","v":1}]
[null,null,null,null,null,null,null,3,2.5,2,1.5,1,"Total",null,null,null,{"$f":"1","v":1},{"$f":"1","v":1}]
[null,null,"VINDUER",null,null,"Velg antall vinduer du ønsker å vurdere (deretter trykk «velg»):",null,null,null,null,{"$f":"IF(AND(G667=\"\",G678>0),\"NB! Husk å velge antall elementer...\",\"\")","v":""},null,null,null,{"$f":"IF(ISERROR(O679+O699+O719+O739)/V668,\"\",(O679+O699+O719+O739)/V668)","v":0},null,{"$f":"0","v":0},{"$f":"IF(asstype=3,0,IF(typescheme=2,0,1))","v":1},null,{"$f":"VLOOKUP(G667,$T$1239:$U$1243,2,FALSE)","v":2}]
[null,null,{"$f":"IF(G667=\"\",\"VINDUER\",\"VINDUER (1)\")","v":"VINDUER"},null,null,"Velg datatype:",null,null,null,null,null,null,null,null,null,null,{"$f":"IF(freq9>=3,0,1)","v":1},1,null,null,{"$f":"IF(G668=\"\",2,IF(ISERROR(VLOOKUP(G668,$T$1246:$U$1247,2,FALSE)),\"\",VLOOKUP(G668,$T$1246:$U$1247,2,FALSE)))","v":2},{"$f":"IF(freq9=3,1,IF(freq9=4,2,IF(freq9=5,3,IF(freq9=6,4,1))))","v":1}]
[null,null,null,{"$f":"IF(AND(P679>=1,type1=1),\"NB! Volum av nivåene kan ikke være større enn det totale volumet for hvert enkelt materiale!\",+IF(AND(P679>=1,type1=2),\"NB! Prosentandel for hvert nivå må registreres i prosent av det vurderte bygningselementet, og den totale prosentandelen kan ikke være større enn den totale prosent av hvert enkelt materiale!\",\"\"))","v":""},null,null,null,null,null,null,null,null,null,null,null,null,1,1]
[null,null,{"$f":"IF(G668=\"\",\"\",IF(SUM(G670:G677)=0,\"\",IF(U668=1,IF(U668+L678=1,\"REGISTRER DET TOTALE VOLUMET AV RELEVANTE MATERIALER\",IF((U668+G678+L678)=1,\"REGISTRER DET TOTALE VOLUMET AV RELEVANTE MATERIALER\",IF(ISERROR(C679),\"REGISTRER DET TOTALE VOLUMET AV RELEVANTE MATERIALER\",IF(OR(G670>L678,G671>L678,G672>L678,G673>L678,G674>L678,G675>L678,G676>L678,G677>L678),\"Volumet av de enkelte materialer kan ikke overstige mengden relevante materialer\",IF(SUM(G670:G677)>L678,\"Den totale mengden av materialer kan ikke overstige det  totale volumet av relevante materialer\",\"\"))))),IF(U668=2,IF(SUM(G670:G677)<80,\"Minst 80 % av de relevante materialer må vurderes, vennligst beregn på nytt.\",IF(OR(G670>100,G671>100,G672>100,G673>100,G674>100,G675>100,G676>100,G677>100),\"Prosentandel av de enkelte materialerer kan ikke overstige 100\",IF(SUM(G670:G677)>100,\"Den totale prosentandelen av materialer kan ikke overstige 100\",\"\")))))))","v":""},null,"Mat. 1",null,null,null,null,null,null,null,{"$f":"IF(SUM(H686+I686+J686+K686+L686)>=3,\"3,00\",SUM(H686+I686+J686+K686+L686))","v":0},{"$f":"IF(AND(U668=1,L678=\"\"),0,IF(OR(NOT(D669=\"\"),NOT(C670=\"\"),NOT(N671=\"\")),0,IF(ISERROR(N679),\"0\",N679)))","v":0},null,{"$f":"IF(SUM(H670:L670)>G670,\"1\",\"0\")","v":"0"},1,1]
[null,null,null,null,"Mat. 2",null,null,null,null,null,null,null,null,{"$f":"IF(AND(U668=1,L678=\"\"),C670,+IF(G679>L678,C670,(IF(N679<80,\"Ingen poeng oppnådd,\nmindre enn 80 % oppfyller kravet\",\"\"))))","v":""},null,{"$f":"IF(SUM(H671:L671)>G671,\"1\",\"0\")","v":"0"},1,1]
[null,null,null,null,"Mat. 3",null,null,null,null,null,null,null,null,null,null,"0",1,1]
[null,null,null,null,"Mat. 4",null,null,null,null,null,null,null,null,null,null,"0",1,1]
[null,null,null,null,"Mat. 5",null,null,null,null,null,null,null,null,null,null,"0",1,1]
[null,null,null,null,"Mat. 6",null,null,null,null,null,null,null,null,null,null,"0",1,1]
[null,null,null,null,"Mat. 7",null,null,null,null,null,null,null,null,null,null,"0",1,1]
[null,null,null,null,"Mat. 8",null,null,null,null,null,null,null,null,null,null,"0",1,1]
[null,null,null,null,"Totalt % av bygningselementet (relevante materialer) vurdert:",null,{"$f":"IF(U668=\"\",0,IF(U668+L678=1,0,IF(SUM(G670:G677)=0,0,IF(U668=1,IF(OR(G670>L678,G671>L678,G672>L678,G673>L678,G674>L678,G675>L678,G676>L678,G677>L678,SUM(G670:G677)>L678),0,((SUM(G670:G677)/L678)*100)),IF(U668=2,IF(OR(G670>100,G671>100,G672>100,G673>100,G674>100,G675>100,G676>100,G677>100,SUM(G670:G677)>100),0,SUM(G670:G677)))))))","v":0},"Samlet volum for aktuelle elementer:",null,null,null,null,null,null,null,null,1,1]
[null,null,{"$f":"IF(G678=0,\"0\",IF(U668=2,\"0\",IF(U668=1,(G678/100)*100,IF(U668=2,(G678/100)*100))))","v":"0"},{"$f":"G678","v":0},null,"Total",{"$f":"IF(SUM(G670:G677)=0,\"1\",SUM(G670:G677))","v":"1"},{"$f":"SUM(H670:H677)","v":0},{"$f":"SUM(I670:I677)","v":0},{"$f":"SUM(J670:J677)","v":0},{"$f":"SUM(K670:K677)","v":0},{"$f":"SUM(L670:L677)","v":0},null,{"$f":"SUM(H680:L680)","v":0},{"$f":"IF(G678<80,\"0,00\",IF(P679>0,\"0\",IF(G678>100,\"0,00\",IF(N670>=80,M670,IF(N670<80,0)))))","v":"0,00"},{"$f":"P670+P671+P672+P673+P674+P675+P676+P677","v":0},{"$f":"1","v":1},{"$f":"1","v":1}]
[null,null,null,null,null,null,"Percentage",{"$f":"IF(H679+G679=0,\"0\",(H679/G679)*100)","v":0},{"$f":"IF(I679+G679=0,\"0\",(I679/G679)*100)","v":0},{"$f":"IF(J679+G679=0,\"0\",(J679/G679)*100)","v":0},{"$f":"IF(K679+G679=0,\"0\",(K679/G679)*100)","v":0},{"$f":"IF(L679+G679=0,\"0\",(L679/G679)*100)","v":0},null,100,null,null,{"$f":"1","v":1},{"$f":"1","v":1}]
[null,null,null,null,null,{"$f":"IF(U668=1,((G679/100)*80))","v":false},"% of 80",{"$f":"(H680/80)*100","v":0},{"$f":"(I680/80)*100","v":0},{"$f":"(J680/80)*100","v":0},{"$f":"(K680/80)*100","v":0},{"$f":"(L680/80)*100","v":0},null,null,null,null,{"$f":"1","v":1},{"$f":"1","v":1}]
[null,null,null,null,null,null,"Limiter",{"$f":"IF(H681>100,\"100\",H681)","v":0},{"$f":"IF(I681>100,\"100\",I681)","v":0},{"$f":"IF(J681>100,\"100\",J681)","v":0},{"$f":"IF(K681>100,\"100\",K681)","v":0},{"$f":"IF(L681>100,\"100\",L681)","v":0},null,null,null,null,{"$f":"1","v":1},{"$f":"1","v":1}]
[null,null,null,null,null,null,null,null,{"$f":"IF(H682+I682+J682+K682+L682=0,0,100-(H682))","v":0},{"$f":"IF(H682+I682+J682+K682+L682=0,0,100-(H682+I682))","v":0},{"$f":"IF(J682+I682+H682+K682+L682=0,0,100-(J682+I682+H682))","v":0},{"$f":"IF(K682+J682+I682+H682+L682=0,0,100-(H682+I682+K682+J682))","v":0},null,null,null,null,{"$f":"1","v":1},{"$f":"1","v":1}]
[null,null,null,null,null,null,null,null,{"$f":"IF(I682>I683,I683,I682)","v":0},{"$f":"IF(J682>J683,J683,J682)","v":0},{"$f":"IF(K682>K683,K683,K682)","v":0},{"$f":"IF(L682>L683,L683,L682)","v":0},null,null,null,null,{"$f":"1","v":1},{"$f":"1","v":1}]
[null,null,null,null,null,null,null,null,null,null,null,{"$f":"IF(K684+J682+H682+I682>=100,0,L684)","v":0},null,null,null,null,{"$f":"1","v":1},{"$f":"1","v":1}]
[null,null,null,null,null,null,"Scores",{"$f":"IF(H679=0,0,0.01*(H682*H687))","v":0},{"$f":"IF(I679=0,0,0.01*(I684*I687))","v":0},{"$f":"IF(J679=0,0,0.01*(J684*J687))","v":0},{"$f":"IF(K679=0,0,0.01*(K684*K687))","v":0},{"$f":"IF(L679=0,0,0.01*(L685*L687))","v":0},null,null,null,null,{"$f":"1","v":1},{"$f":"1","v":1}]
[null,null,null,null,null,null,null,3,2.5,2,1.5,1,null,null,null,null,{"$f":"1","v":1},{"$f":"1","v":1}]
[null,null,"VINDUER (2)",null,null,"Velg datatype:",null,null,null,null,null,null,null,null,null,null,{"$f":"IF(freq9>=4,0,1)","v":1},{"$f":"1","v":1},null,null,{"$f":"IF(G688=\"\",2,IF(ISERROR(VLOOKUP(G688,$T$1246:$U$1247,2,FALSE)),\"\",VLOOKUP(G688,$T$1246:$U$1247,2,FALSE)))","v":2}]
[null,null,null,{"$f":"IF(AND(P699>=1,type1=1),\"NB! Volum av nivåene kan ikke være større enn det totale volumet for hvert enkelt materiale!\",+IF(AND(P699>=1,type1=2),\"NB! Prosentandel for hvert nivå må registreres i prosent av det vurderte bygningselementet, og den totale prosentandelen kan ikke være større enn den totale prosent av hvert enkelt materiale!\",\"\"))","v":""},null,null,null,null,null,null,null,null,null,null,null,null,1,{"$f":"1","v":1}]
[null,null,{"$f":"IF(G688=\"\",\"\",IF(SUM(G690:G697)=0,\"\",IF(U688=1,IF(U688+L698=1,\"REGISTRER DET TOTALE VOLUMET AV RELEVANTE MATERIALER\",IF((U688+G698+L698)=1,\"REGISTRER DET TOTALE VOLUMET AV RELEVANTE MATERIALER\",IF(ISERROR(C699),\"REGISTRER DET TOTALE VOLUMET AV RELEVANTE MATERIALER\",IF(OR(G690>L698,G691>L698,G692>L698,G693>L698,G694>L698,G695>L698,G696>L698,G697>L698),\"Volumet av de enkelte materialer kan ikke overstige mengden relevante materialer\",IF(SUM(G690:G697)>L698,\"Den totale mengden av materialer kan ikke overstige det  totale volumet av relevante materialer\",\"\"))))),IF(U688=2,IF(SUM(G690:G697)<80,\"Minst 80 % av de relevante materialer må vurderes, vennligst beregn på nytt.\",IF(OR(G690>100,G691>100,G692>100,G693>100,G694>100,G695>100,G696>100,G697>100),\"Prosentandel av de enkelte materialerer kan ikke overstige 100\",IF(SUM(G690:G697)>100,\"Den totale prosentandelen av materialer kan ikke overstige 100\",\"\")))))))","v":""},null,"Mat. 1",null,null,null,null,null,null,null,{"$f":"IF(SUM(H706+I706+J706+K706+L706)>=3,\"3,00\",SUM(H706+I706+J706+K706+L706))","v":0},{"$f":"IF(AND(U692=1,L698=\"\"),0,IF(OR(NOT(D689=\"\"),NOT(C690=\"\"),NOT(N691=\"\")),0,IF(ISERROR(N699),\"0\",N699)))","v":0},null,{"$f":"IF(SUM(H690:L690)>G690,\"1\",\"0\")","v":"0"},1,{"$f":"1","v":1}]
[null,null,null,null,"Mat. 2",null,null,null,null,null,null,null,null,{"$f":"IF(AND(U688=1,L698=\"\"),C690,+IF(G699>L698,C690,(IF(N699<80,\"Ingen poeng oppnådd,\nmindre enn 80 % oppfyller kravet\",\"\"))))","v":""},null,{"$f":"IF(SUM(H691:L691)>G691,\"1\",\"0\")","v":"0"},1,{"$f":"1","v":1}]
[null,null,null,null,"Mat. 3",null,null,null,null,null,null,null,null,null,null,"0",1,{"$f":"1","v":1}]
[null,null,null,null,"Mat. 4",null,null,null,null,null,null,null,null,null,null,"0",1,{"$f":"1","v":1}]
[null,null,null,null,"Mat. 5",null,null,null,null,null,null,null,null,null,null,"0",1,{"$f":"1","v":1}]
[null,null,null,null,"Mat. 6",null,null,null,null,null,null,null,null,null,null,"0",1,{"$f":"1","v":1}]
[null,null,null,null,"Mat. 7",null,null,null,null,null,null,null,null,null,null,"0",1,{"$f":"1","v":1}]
[null,null,null,null,"Mat. 8",null,null,null,null,null,null,null,null,null,null,"0",1,{"$f":"1","v":1}]
[null,null,null,null,"Totalt % av bygningselementet (relevante materialer) vurdert:",null,{"$f":"IF(U688=\"\",0,IF(U688+L698=1,0,IF(SUM(G690:G697)=0,0,IF(U688=1,IF(OR(G690>L698,G691>L698,G692>L698,G693>L698,G694>L698,G695>L698,G696>L698,G697>L698,SUM(G690:G697)>L698),0,((SUM(G690:G697)/L698)*100)),IF(U688=2,IF(OR(G690>100,G691>100,G692>100,G693>100,G694>100,G695>100,G696>100,G697>100,SUM(G690:G697)>100),0,SUM(G690:G697)))))))","v":0},"Samlet volum for aktuelle elementer:",null,null,null,null,null,null,null,null,1,{"$f":"1","v":1}]
[null,null,{"$f":"IF(G698=0,\"0\",IF(U688=2,\"0\",IF(U688=1,(G698/100)*100,IF(U688=2,(G698/100)*100))))","v":"0"},{"$f":"G698","v":0},null,"Total",{"$f":"IF(SUM(G690:G697)=0,\"1\",SUM(G690:G697))","v":"1"},{"$f":"SUM(H690:H697)","v":0},{"$f":"SUM(I690:I697)","v":0},{"$f":"SUM(J690:J697)","v":0},{"$f":"SUM(K690:K697)","v":0},{"$f":"SUM(L690:L697)","v":0},null,{"$f":"SUM(H700:L700)","v":0},{"$f":"IF(G698<80,\"0,00\",IF(P699>0,\"0\",IF(G698>100,\"0,00\",IF(N690>=80,M690,IF(N690<80,0)))))","v":"0,00"},{"$f":"P690+P691+P692+P693+P694+P695+P696+P697","v":0},{"$f":"1","v":1},{"$f":"1","v":1}]
[null,null,null,null,null,null,"Percentage",{"$f":"IF(H699+G699=0,\"0\",(H699/G699)*100)","v":0},{"$f":"IF(I699+G699=0,\"0\",(I699/G699)*100)","v":0},{"$f":"IF(J699+G699=0,\"0\",(J699/G699)*100)","v":0},{"$f":"IF(K699+G699=0,\"0\",(K699/G699)*100)","v":0},{"$f":"IF(L699+G699=0,\"0\",(L699/G699)*100)","v":0},null,100,null,null,{"$f":"1","v":1},{"$f":"1","v":1}]
[null,null,null,null,null,{"$f":"IF(U688=1,((G699/100)*80))","v":false},"% of 80",{"$f":"(H700/80)*100","v":0},{"$f":"(I700/80)*100","v":0},{"$f":"(J700/80)*100","v":0},{"$f":"(K700/80)*100","v":0},{"$f":"(L700/80)*100","v":0},null,null,null,null,{"$f":"1","v":1},{"$f":"1","v":1}]
[null,null,null,null,null,null,"Limiter",{"$f":"IF(H701>100,\"100\",H701)","v":0},{"$f":"IF(I701>100,\"100\",I701)","v":0},{"$f":"IF(J701>100,\"100\",J701)","v":0},{"$f":"IF(K701>100,\"100\",K701)","v":0},{"$f":"IF(L701>100,\"100\",L701)","v":0},null,null,null,null,{"$f":"1","v":1},{"$f":"1","v":1}]
[null,null,null,null,null,null,null,null,{"$f":"IF(H702+I702+J702+K702+L702=0,0,100-(H702))","v":0},{"$f":"IF(H702+I702+J702+K702+L702=0,0,100-(H702+I702))","v":0},{"$f":"IF(J702+I702+H702+K702+L702=0,0,100-(J702+I702+H702))","v":0},{"$f":"IF(K702+J702+I702+H702+L702=0,0,100-(H702+I702+K702+J702))","v":0},null,null,null,null,{"$f":"1","v":1},{"$f":"1","v":1}]
[null,null,null,null,null,null,null,null,{"$f":"IF(I702>I703,I703,I702)","v":0},{"$f":"IF(J702>J703,J703,J702)","v":0},{"$f":"IF(K702>K703,K703,K702)","v":0},{"$f":"IF(L702>L703,L703,L702)","v":0},null,null,null,null,{"$f":"1","v":1},{"$f":"1","v":1}]
[null,null,null,null,null,null,null,null,null,null,null,{"$f":"IF(K704+J702+H702+I702>=100,0,L704)","v":0},null,null,null,null,{"$f":"1","v":1},{"$f":"1","v":1}]
[null,null,null,null,null,null,"Scores",{"$f":"IF(H699=0,0,0.01*(H702*H707))","v":0},{"$f":"IF(I699=0,0,0.01*(I704*I707))","v":0},{"$f":"IF(J699=0,0,0.01*(J704*J707))","v":0},{"$f":"IF(K699=0,0,0.01*(K704*K707))","v":0},{"$f":"IF(L699=0,0,0.01*(L705*L707))","v":0},null,null,null,null,{"$f":"1","v":1},{"$f":"1","v":1}]
[null,null,null,null,null,null,null,3,2.5,2,1.5,1,null,null,null,null,{"$f":"1","v":1},{"$f":"1","v":1}]
[null,null,"VINDUER (3)",null,null,"Velg datatype:",null,null,null,null,null,null,null,null,null,null,{"$f":"IF(freq9>=5,0,1)","v":1},{"$f":"1","v":1},null,null,{"$f":"IF(G708=\"\",2,IF(ISERROR(VLOOKUP(G708,$T$1246:$U$1247,2,FALSE)),\"\",VLOOKUP(G708,$T$1246:$U$1247,2,FALSE)))","v":2}]
[null,null,null,{"$f":"IF(AND(P719>=1,type1=1),\"NB! Volum av nivåene kan ikke være større enn det totale volumet for hvert enkelt materiale!\",+IF(AND(P719>=1,type1=2),\"NB! Prosentandel for hvert nivå må registreres i prosent av det vurderte bygningselementet, og den totale prosentandelen kan ikke være større enn den totale prosent av hvert enkelt materiale!\",\"\"))","v":""},null,null,null,null,null,null,null,null,null,null,null,null,1,{"$f":"1","v":1}]
[null,null,{"$f":"IF(G708=\"\",\"\",IF(SUM(G710:G717)=0,\"\",IF(U708=1,IF(U708+L718=1,\"REGISTRER DET TOTALE VOLUMET AV RELEVANTE MATERIALER\",IF((U708+G718+L718)=1,\"REGISTRER DET TOTALE VOLUMET AV RELEVANTE MATERIALER\",IF(ISERROR(C719),\"REGISTRER DET TOTALE VOLUMET AV RELEVANTE MATERIALER\",IF(OR(G710>L718,G711>L718,G712>L718,G713>L718,G714>L718,G715>L718,G716>L718,G717>L718),\"Volumet av de enkelte materialer kan ikke overstige mengden relevante materialer\",IF(SUM(G710:G717)>L718,\"Den totale mengden av materialer kan ikke overstige det  totale volumet av relevante materialer\",\"\"))))),IF(U708=2,IF(SUM(G710:G717)<80,\"Minst 80 % av de relevante materialer må vurderes, vennligst beregn på nytt.\",IF(OR(G710>100,G711>100,G712>100,G713>100,G714>100,G715>100,G716>100,G717>100),\"Prosentandel av de enkelte materialerer kan ikke overstige 100\",IF(SUM(G710:G717)>100,\"Den totale prosentandelen av materialer kan ikke overstige 100\",\"\")))))))","v":""},null,"Mat. 1",null,null,null,null,null,null,null,{"$f":"IF(SUM(H726+I726+J726+K726+L726)>=3,\"3,00\",SUM(H726+I726+J726+K726+L726))","v":0},{"$f":"IF(AND(U712=1,L718=\"\"),0,IF(OR(NOT(D709=\"\"),NOT(C710=\"\"),NOT(N711=\"\")),0,IF(ISERROR(N719),\"0\",N719)))","v":0},null,{"$f":"IF(SUM(H710:L710)>G710,\"1\",\"0\")","v":"0"},1,{"$f":"1","v":1}]
[null,null,null,null,"Mat. 2",null,null,null,null,null,null,null,null,{"$f":"IF(AND(U708=1,L718=\"\"),C710,+IF(G719>L718,C710,(IF(N719<80,\"Ingen poeng oppnådd,\nmindre enn 80 % oppfyller kravet\",\"\"))))","v":""},null,{"$f":"IF(SUM(H711:L711)>G711,\"1\",\"0\")","v":"0"},1,{"$f":"1","v":1}]
[null,null,null,null,"Mat. 3",null,null,null,null,null,null,null,null,null,null,"0",1,{"$f":"1","v":1}]
[null,null,null,null,"Mat. 4",null,null,null,null,null,null,null,null,null,null,"0",1,{"$f":"1","v":1}]
[null,null,null,null,"Mat. 5",null,null,null,null,null,null,null,null,null,null,"0",1,{"$f":"1","v":1}]
[null,null,null,null,"Mat. 6",null,null,null,null,null,null,null,null,null,null,"0",1,{"$f":"1","v":1}]
[null,null,null,null,"Mat. 7",null,null,null,null,null,null,null,null,null,null,"0",1,{"$f":"1","v":1}]
[null,null,null,null,"Mat. 8",null,null,null,null,null,null,null,null,null,null,"0",1,{"$f":"1","v":1}]
[null,null,null,null,"Totalt % av bygningselementet (relevante materialer) vurdert:",null,{"$f":"IF(U708=\"\",0,IF(U708+L718=1,0,IF(SUM(G710:G717)=0,0,IF(U708=1,IF(OR(G710>L718,G711>L718,G712>L718,G713>L718,G714>L718,G715>L718,G716>L718,G717>L718,SUM(G710:G717)>L718),0,((SUM(G710:G717)/L718)*100)),IF(U708=2,IF(OR(G710>100,G711>100,G712>100,G713>100,G714>100,G715>100,G716>100,G717>100,SUM(G710:G717)>100),0,SUM(G710:G717)))))))","v":0},"Samlet volum for aktuelle elementer:",null,null,null,null,null,null,null,null,1,{"$f":"1","v":1}]
[null,null,{"$f":"IF(G718=0,\"0\",IF(U708=2,\"0\",IF(U708=1,(G718/100)*100,IF(U708=2,(G718/100)*100))))","v":"0"},{"$f":"G718","v":0},null,"Total",{"$f":"IF(SUM(G710:G717)=0,\"1\",SUM(G710:G717))","v":"1"},{"$f":"SUM(H710:H717)","v":0},{"$f":"SUM(I710:I717)","v":0},{"$f":"SUM(J710:J717)","v":0},{"$f":"SUM(K710:K717)","v":0},{"$f":"SUM(L710:L717)","v":0},null,{"$f":"SUM(H720:L720)","v":0},{"$f":"IF(G718<80,\"0,00\",IF(P719>0,\"0\",IF(G718>100,\"0,00\",IF(N710>=80,M710,IF(N710<80,0)))))","v":"0,00"},{"$f":"P710+P711+P712+P713+P714+P715+P716+P717","v":0},{"$f":"1","v":1},{"$f":"1","v":1}]
[null,null,null,null,null,null,"Percentage",{"$f":"IF(H719+G719=0,\"0\",(H719/G719)*100)","v":0},{"$f":"IF(I719+G719=0,\"0\",(I719/G719)*100)","v":0},{"$f":"IF(J719+G719=0,\"0\",(J719/G719)*100)","v":0},{"$f":"IF(K719+G719=0,\"0\",(K719/G719)*100)","v":0},{"$f":"IF(L719+G719=0,\"0\",(L719/G719)*100)","v":0},null,100,null,null,{"$f":"1","v":1},{"$f":"1","v":1}]
[null,null,null,null,null,{"$f":"IF(U708=1,((G719/100)*80))","v":false},"% of 80",{"$f":"(H720/80)*100","v":0},{"$f":"(I720/80)*100","v":0},{"$f":"(J720/80)*100","v":0},{"$f":"(K720/80)*100","v":0},{"$f":"(L720/80)*100","v":0},null,null,null,null,{"$f":"1","v":1},{"$f":"1","v":1}]
[null,null,null,null,null,null,"Limiter",{"$f":"IF(H721>100,\"100\",H721)","v":0},{"$f":"IF(I721>100,\"100\",I721)","v":0},{"$f":"IF(J721>100,\"100\",J721)","v":0},{"$f":"IF(K721>100,\"100\",K721)","v":0},{"$f":"IF(L721>100,\"100\",L721)","v":0},null,null,null,null,{"$f":"1","v":1},{"$f":"1","v":1}]
[null,null,null,null,null,null,null,null,{"$f":"IF(H722+I722+J722+K722+L722=0,0,100-(H722))","v":0},{"$f":"IF(H722+I722+J722+K722+L722=0,0,100-(H722+I722))","v":0},{"$f":"IF(J722+I722+H722+K722+L722=0,0,100-(J722+I722+H722))","v":0},{"$f":"IF(K722+J722+I722+H722+L722=0,0,100-(H722+I722+K722+J722))","v":0},null,null,null,null,{"$f":"1","v":1},{"$f":"1","v":1}]
[null,null,null,null,null,null,null,null,{"$f":"IF(I722>I723,I723,I722)","v":0},{"$f":"IF(J722>J723,J723,J722)","v":0},{"$f":"IF(K722>K723,K723,K722)","v":0},{"$f":"IF(L722>L723,L723,L722)","v":0},null,null,null,null,{"$f":"1","v":1},{"$f":"1","v":1}]
[null,null,null,null,null,null,null,null,null,null,null,{"$f":"IF(K724+J722+H722+I722>=100,0,L724)","v":0},null,null,null,null,{"$f":"1","v":1},{"$f":"1","v":1}]
[null,null,null,null,null,null,"Scores",{"$f":"IF(H719=0,0,0.01*(H722*H727))","v":0},{"$f":"IF(I719=0,0,0.01*(I724*I727))","v":0},{"$f":"IF(J719=0,0,0.01*(J724*J727))","v":0},{"$f":"IF(K719=0,0,0.01*(K724*K727))","v":0},{"$f":"IF(L719=0,0,0.01*(L725*L727))","v":0},null,null,null,null,{"$f":"1","v":1},{"$f":"1","v":1}]
[null,null,null,null,null,null,null,3,2.5,2,1.5,1,null,null,null,null,{"$f":"1","v":1},{"$f":"1","v":1}]
[null,null,"VINDUER (4)",null,null,"Velg datatype:",null,null,null,null,null,null,null,null,null,null,{"$f":"IF(freq9>=6,0,1)","v":1},{"$f":"1","v":1},null,null,{"$f":"IF(G728=\"\",2,IF(ISERROR(VLOOKUP(G728,$T$1246:$U$1247,2,FALSE)),\"\",VLOOKUP(G728,$T$1246:$U$1247,2,FALSE)))","v":2}]
[null,null,null,{"$f":"IF(AND(P739>=1,type1=1),\"NB! Volum av nivåene kan ikke være større enn det totale volumet for hvert enkelt materiale!\",+IF(AND(P739>=1,type1=2),\"NB! Prosentandel for hvert nivå må registreres i prosent av det vurderte bygningselementet, og den totale prosentandelen kan ikke være større enn den totale prosent av hvert enkelt materiale!\",\"\"))","v":""},null,null,null,null,null,null,null,null,null,null,null,null,1,{"$f":"1","v":1}]
[null,null,{"$f":"IF(G728=\"\",\"\",IF(SUM(G730:G737)=0,\"\",IF(U728=1,IF(U728+L738=1,\"REGISTRER DET TOTALE VOLUMET AV RELEVANTE MATERIALER\",IF((U728+G738+L738)=1,\"REGISTRER DET TOTALE VOLUMET AV RELEVANTE MATERIALER\",IF(ISERROR(C739),\"REGISTRER DET TOTALE VOLUMET AV RELEVANTE MATERIALER\",IF(OR(G730>L738,G731>L738,G732>L738,G733>L738,G734>L738,G735>L738,G736>L738,G737>L738),\"Volumet av de enkelte materialer kan ikke overstige mengden relevante materialer\",IF(SUM(G730:G737)>L738,\"Den totale mengden av materialer kan ikke overstige det  totale volumet av relevante materialer\",\"\"))))),IF(U728=2,IF(SUM(G730:G737)<80,\"Minst 80 % av de relevante materialer må vurderes, vennligst beregn på nytt.\",IF(OR(G730>100,G731>100,G732>100,G733>100,G734>100,G735>100,G736>100,G737>100),\"Prosentandel av de enkelte materialerer kan ikke overstige 100\",IF(SUM(G730:G737)>100,\"Den totale prosentandelen av materialer kan ikke overstige 100\",\"\")))))))","v":""},null,"Mat. 1",null,null,null,null,null,null,null,{"$f":"IF(SUM(H746+I746+J746+K746+L746)>=3,\"3,00\",SUM(H746+I746+J746+K746+L746))","v":0},{"$f":"IF(AND(U732=1,L738=\"\"),0,IF(OR(NOT(D729=\"\"),NOT(C730=\"\"),NOT(N731=\"\")),0,IF(ISERROR(N739),\"0\",N739)))","v":0},null,{"$f":"IF(SUM(H730:L730)>G730,\"1\",\"0\")","v":"0"},1,{"$f":"1","v":1}]
[null,null,null,null,"Mat. 2",null,null,null,null,null,null,null,null,{"$f":"IF(AND(U728=1,L738=\"\"),C730,+IF(G739>L738,C730,(IF(N739<80,\"Ingen poeng oppnådd,\nmindre enn 80 % oppfyller kravet\",\"\"))))","v":""},null,{"$f":"IF(SUM(H731:L731)>G731,\"1\",\"0\")","v":"0"},1,{"$f":"1","v":1}]
[null,null,null,null,"Mat. 3",null,null,null,null,null,null,null,null,null,null,"0",1,{"$f":"1","v":1}]
[null,null,null,null,"Mat. 4",null,null,null,null,null,null,null,null,null,null,"0",1,{"$f":"1","v":1}]
[null,null,null,null,"Mat. 5",null,null,null,null,null,null,null,null,null,null,"0",1,{"$f":"1","v":1}]
[null,null,null,null,"Mat. 6",null,null,null,null,null,null,null,null,null,null,"0",1,{"$f":"1","v":1}]
[null,null,null,null,"Mat. 7",null,null,null,null,null,null,null,null,null,null,"0",1,{"$f":"1","v":1}]
[null,null,null,null,"Mat. 8",null,null,null,null,null,null,null,null,null,null,"0",1,{"$f":"1","v":1}]
[null,null,null,null,"Totalt % av bygningselementet (relevante materialer) vurdert:",null,{"$f":"IF(U728=\"\",0,IF(U728+L738=1,0,IF(SUM(G730:G737)=0,0,IF(U728=1,IF(OR(G730>L738,G731>L738,G732>L738,G733>L738,G734>L738,G735>L738,G736>L738,G737>L738,SUM(G730:G737)>L738),0,((SUM(G730:G737)/L738)*100)),IF(U728=2,IF(OR(G730>100,G731>100,G732>100,G733>100,G734>100,G735>100,G736>100,G737>100,SUM(G730:G737)>100),0,SUM(G730:G737)))))))","v":0},"Samlet volum for aktuelle elementer:",null,null,null,null,null,null,null,null,1,{"$f":"1","v":1}]
[null,null,{"$f":"IF(G738=0,\"0\",IF(U728=2,\"0\",IF(U728=1,(G738/100)*100,IF(U728=2,(G738/100)*100))))","v":"0"},{"$f":"G738","v":0},null,"Total",{"$f":"IF(SUM(G730:G737)=0,\"1\",SUM(G730:G737))","v":"1"},{"$f":"SUM(H730:H737)","v":0},{"$f":"SUM(I730:I737)","v":0},{"$f":"SUM(J730:J737)","v":0},{"$f":"SUM(K730:K737)","v":0},{"$f":"SUM(L730:L737)","v":0},null,{"$f":"SUM(H740:L740)","v":0},{"$f":"IF(G738<80,\"0,00\",IF(P739>0,\"0\",IF(G738>100,\"0,00\",IF(N730>=80,M730,IF(N730<80,0)))))","v":"0,00"},{"$f":"P730+P731+P732+P733+P734+P735+P736+P737","v":0},{"$f":"1","v":1},{"$f":"1","v":1}]
[null,null,null,null,null,null,"Percentage",{"$f":"IF(H739+G739=0,\"0\",(H739/G739)*100)","v":0},{"$f":"IF(I739+G739=0,\"0\",(I739/G739)*100)","v":0},{"$f":"IF(J739+G739=0,\"0\",(J739/G739)*100)","v":0},{"$f":"IF(K739+G739=0,\"0\",(K739/G739)*100)","v":0},{"$f":"IF(L739+G739=0,\"0\",(L739/G739)*100)","v":0},null,100,null,null,{"$f":"1","v":1},{"$f":"1","v":1}]
[null,null,null,null,null,{"$f":"IF(U728=1,((G739/100)*80))","v":false},"% of 80",{"$f":"(H740/80)*100","v":0},{"$f":"(I740/80)*100","v":0},{"$f":"(J740/80)*100","v":0},{"$f":"(K740/80)*100","v":0},{"$f":"(L740/80)*100","v":0},null,null,null,null,{"$f":"1","v":1},{"$f":"1","v":1}]
[null,null,null,null,null,null,"Limiter",{"$f":"IF(H741>100,\"100\",H741)","v":0},{"$f":"IF(I741>100,\"100\",I741)","v":0},{"$f":"IF(J741>100,\"100\",J741)","v":0},{"$f":"IF(K741>100,\"100\",K741)","v":0},{"$f":"IF(L741>100,\"100\",L741)","v":0},null,null,null,null,{"$f":"1","v":1},{"$f":"1","v":1}]
[null,null,null,null,null,null,null,null,{"$f":"IF(H742+I742+J742+K742+L742=0,0,100-(H742))","v":0},{"$f":"IF(H742+I742+J742+K742+L742=0,0,100-(H742+I742))","v":0},{"$f":"IF(J742+I742+H742+K742+L742=0,0,100-(J742+I742+H742))","v":0},{"$f":"IF(K742+J742+I742+H742+L742=0,0,100-(H742+I742+K742+J742))","v":0},null,null,null,null,{"$f":"1","v":1},{"$f":"1","v":1}]
[null,null,null,null,null,null,null,null,{"$f":"IF(I742>I743,I743,I742)","v":0},{"$f":"IF(J742>J743,J743,J742)","v":0},{"$f":"IF(K742>K743,K743,K742)","v":0},{"$f":"IF(L742>L743,L743,L742)","v":0},null,null,null,null,{"$f":"1","v":1},{"$f":"1","v":1}]
[null,null,null,null,null,null,null,null,null,null,null,{"$f":"IF(K744+J742+H742+I742>=100,0,L744)","v":0},null,null,null,null,{"$f":"1","v":1},{"$f":"1","v":1}]
[null,null,null,null,null,null,"Scores",{"$f":"IF(H739=0,0,0.01*(H742*H747))","v":0},{"$f":"IF(I739=0,0,0.01*(I744*I747))","v":0},{"$f":"IF(J739=0,0,0.01*(J744*J747))","v":0},{"$f":"IF(K739=0,0,0.01*(K744*K747))","v":0},{"$f":"IF(L739=0,0,0.01*(L745*L747))","v":0},null,null,null,null,{"$f":"1","v":1},{"$f":"1","v":1}]
[null,null,null,null,null,null,null,3,2.5,2,1.5,1,null,null,null,null,{"$f":"1","v":1},{"$f":"1","v":1}]
[null,null,"UTV. OG INNV. DØRER",null,null,"Velg antall utv. og innv. dører du ønsker å vurdere (deretter trykk «velg»):",null,null,null,null,{"$f":"IF(AND(G748=\"\",G759>0),\"NB! Husk å velge antall elementer...\",\"\")","v":""},null,null,null,{"$f":"IF(ISERROR(O760+O780+O800+O820)/V749,\"\",(O760+O780+O800+O820)/V749)","v":0},null,{"$f":"0","v":0},{"$f":"IF(asstype=3,0,IF(typescheme=2,0,1))","v":1},null,{"$f":"VLOOKUP(G748,$T$1239:$U$1243,2,FALSE)","v":2}]
[null,null,{"$f":"IF(G748=\"\",\"DØRER\",\"DØRER (1)\")","v":"DØRER"},null,null,"Velg datatype:",null,null,null,null,null,null,null,null,null,null,{"$f":"IF(freq10>=3,0,1)","v":1},1,null,null,{"$f":"IF(G749=\"\",2,IF(ISERROR(VLOOKUP(G749,$T$1246:$U$1247,2,FALSE)),\"\",VLOOKUP(G749,$T$1246:$U$1247,2,FALSE)))","v":2},{"$f":"IF(freq10=3,1,IF(freq10=4,2,IF(freq10=5,3,IF(freq10=6,4,1))))","v":1}]
[null,null,null,{"$f":"IF(AND(P760>=1,type1=1),\"NB! Volum av nivåene kan ikke være større enn det totale volumet for hvert enkelt materiale!\",+IF(AND(P760>=1,type1=2),\"NB! Prosentandel for hvert nivå må registreres i prosent av det vurderte bygningselementet, og den totale prosentandelen kan ikke være større enn den totale prosent av hvert enkelt materiale!\",\"\"))","v":""},null,null,null,null,null,null,null,null,null,null,null,null,1,1]
[null,null,{"$f":"IF(G749=\"\",\"\",IF(SUM(G751:G758)=0,\"\",IF(U749=1,IF(U749+L759=1,\"REGISTRER DET TOTALE VOLUMET AV RELEVANTE MATERIALER\",IF((U749+G759+L759)=1,\"REGISTRER DET TOTALE VOLUMET AV RELEVANTE MATERIALER\",IF(ISERROR(C760),\"REGISTRER DET TOTALE VOLUMET AV RELEVANTE MATERIALER\",IF(OR(G751>L759,G752>L759,G753>L759,G754>L759,G755>L759,G756>L759,G757>L759,G758>L759),\"Volumet av de enkelte materialer kan ikke overstige mengden relevante materialer\",IF(SUM(G751:G758)>L759,\"Den totale mengden av materialer kan ikke overstige det  totale volumet av relevante materialer\",\"\"))))),IF(U749=2,IF(SUM(G751:G758)<80,\"Minst 80 % av de relevante materialer må vurderes, vennligst beregn på nytt.\",IF(OR(G751>100,G752>100,G753>100,G754>100,G755>100,G756>100,G757>100,G758>100),\"Prosentandel av de enkelte materialerer kan ikke overstige 100\",IF(SUM(G751:G758)>100,\"Den totale prosentandelen av materialer kan ikke overstige 100\",\"\")))))))","v":""},null,"Mat. 1",null,null,null,null,null,null,null,{"$f":"IF(SUM(H767+I767+J767+K767+L767)>=3,\"3,00\",SUM(H767+I767+J767+K767+L767))","v":0},{"$f":"IF(AND(U749=1,L759=\"\"),0,IF(OR(NOT(D750=\"\"),NOT(C751=\"\"),NOT(N752=\"\")),0,IF(ISERROR(N760),\"0\",N760)))","v":0},null,{"$f":"IF(SUM(H751:L751)>G751,\"1\",\"0\")","v":"0"},1,1]
[null,null,null,null,"Mat. 2",null,null,null,null,null,null,null,null,{"$f":"IF(AND(U749=1,L759=\"\"),C751,+IF(G760>L759,C751,(IF(N760<80,\"Ingen poeng oppnådd,\nmindre enn 80 % oppfyller kravet\",\"\"))))","v":""},null,{"$f":"IF(SUM(H752:L752)>G752,\"1\",\"0\")","v":"0"},1,1]
[null,null,null,null,"Mat. 3",null,null,null,null,null,null,null,null,null,null,"0",1,1]
[null,null,null,null,"Mat. 4",null,null,null,null,null,null,null,null,null,null,"0",1,1]
[null,null,null,null,"Mat. 5",null,null,null,null,null,null,null,null,null,null,"0",1,1]
[null,null,null,null,"Mat. 6",null,null,null,null,null,null,null,null,null,null,"0",1,1]
[null,null,null,null,"Mat. 7",null,null,null,null,null,null,null,null,null,null,"0",1,1]
[null,null,null,null,"Mat. 8",null,null,null,null,null,null,null,null,null,null,"0",1,1]
[null,null,null,null,"Totalt % av bygningselementet (relevante materialer) vurdert:",null,{"$f":"IF(U749=\"\",0,IF(U749+L759=1,0,IF(SUM(G751:G758)=0,0,IF(U749=1,IF(OR(G751>L759,G752>L759,G753>L759,G754>L759,G755>L759,G756>L759,G757>L759,G758>L759,SUM(G751:G758)>L759),0,((SUM(G751:G758)/L759)*100)),IF(U749=2,IF(OR(G751>100,G752>100,G753>100,G754>100,G755>100,G756>100,G757>100,G758>100,SUM(G751:G758)>100),0,SUM(G751:G758)))))))","v":0},"Samlet volum for aktuelle elementer:",null,null,null,null,null,null,null,null,1,1]
[null,null,{"$f":"IF(G759=0,\"0\",IF(U752=2,\"0\",IF(U752=1,(G759/100)*100,IF(U752=2,(G759/100)*100))))","v":"0"},{"$f":"G759","v":0},null,"Total",{"$f":"IF(SUM(G751:G758)=0,\"1\",SUM(G751:G758))","v":"1"},{"$f":"SUM(H751:H758)","v":0},{"$f":"SUM(I751:I758)","v":0},{"$f":"SUM(J751:J758)","v":0},{"$f":"SUM(K751:K758)","v":0},{"$f":"SUM(L751:L758)","v":0},null,{"$f":"SUM(H761:L761)","v":0},{"$f":"IF(G759<80,\"0,00\",IF(P760>0,\"0\",IF(G759>100,\"0,00\",IF(N751>=80,M751,IF(N751<80,0)))))","v":"0,00"},{"$f":"P751+P752+P753+P754+P755+P756+P757+P758","v":0},{"$f":"1","v":1},{"$f":"1","v":1}]
[null,null,null,null,null,null,"Percentage",{"$f":"IF(H760+G760=0,\"0\",(H760/G760)*100)","v":0},{"$f":"IF(I760+G760=0,\"0\",(I760/G760)*100)","v":0},{"$f":"IF(J760+G760=0,\"0\",(J760/G760)*100)","v":0},{"$f":"IF(K760+G760=0,\"0\",(K760/G760)*100)","v":0},{"$f":"IF(L760+G760=0,\"0\",(L760/G760)*100)","v":0},null,100,null,null,{"$f":"1","v":1},{"$f":"1","v":1}]
[null,null,null,null,null,{"$f":"IF(U752=1,((G760/100)*80))","v":false},"% of 80",{"$f":"(H761/80)*100","v":0},{"$f":"(I761/80)*100","v":0},{"$f":"(J761/80)*100","v":0},{"$f":"(K761/80)*100","v":0},{"$f":"(L761/80)*100","v":0},null,null,null,null,{"$f":"1","v":1},{"$f":"1","v":1}]
[null,null,null,null,null,null,"Limiter",{"$f":"IF(H762>100,\"100\",H762)","v":0},{"$f":"IF(I762>100,\"100\",I762)","v":0},{"$f":"IF(J762>100,\"100\",J762)","v":0},{"$f":"IF(K762>100,\"100\",K762)","v":0},{"$f":"IF(L762>100,\"100\",L762)","v":0},null,null,null,null,{"$f":"1","v":1},{"$f":"1","v":1}]
[null,null,null,null,null,null,null,null,{"$f":"IF(H763+I763+J763+K763+L763=0,0,100-(H763))","v":0},{"$f":"IF(H763+I763+J763+K763+L763=0,0,100-(H763+I763))","v":0},{"$f":"IF(J763+I763+H763+K763+L763=0,0,100-(J763+I763+H763))","v":0},{"$f":"IF(K763+J763+I763+H763+L763=0,0,100-(H763+I763+K763+J763))","v":0},null,null,null,null,{"$f":"1","v":1},{"$f":"1","v":1}]
[null,null,null,null,null,null,null,null,{"$f":"IF(I763>I764,I764,I763)","v":0},{"$f":"IF(J763>J764,J764,J763)","v":0},{"$f":"IF(K763>K764,K764,K763)","v":0},{"$f":"IF(L763>L764,L764,L763)","v":0},null,null,null,null,{"$f":"1","v":1},{"$f":"1","v":1}]
[null,null,null,null,null,null,null,null,null,null,null,{"$f":"IF(K765+J763+H763+I763>=100,0,L765)","v":0},null,null,null,null,{"$f":"1","v":1},{"$f":"1","v":1}]
[null,null,null,null,null,null,"Scores",{"$f":"IF(H760=0,0,0.01*(H763*H768))","v":0},{"$f":"IF(I760=0,0,0.01*(I765*I768))","v":0},{"$f":"IF(J760=0,0,0.01*(J765*J768))","v":0},{"$f":"IF(K760=0,0,0.01*(K765*K768))","v":0},{"$f":"IF(L760=0,0,0.01*(L766*L768))","v":0},null,null,null,null,{"$f":"1","v":1},{"$f":"1","v":1}]
[null,null,null,null,null,null,null,3,2.5,2,1.5,1,"Total",null,null,null,{"$f":"1","v":1},{"$f":"1","v":1}]
[null,null,"DØRER (2)",null,null,"Velg datatype:",null,null,null,null,null,null,null,null,null,null,{"$f":"IF(freq10>=4,0,1)","v":1},{"$f":"1","v":1},null,null,{"$f":"IF(G769=\"\",2,IF(ISERROR(VLOOKUP(G769,$T$1246:$U$1247,2,FALSE)),\"\",VLOOKUP(G769,$T$1246:$U$1247,2,FALSE)))","v":2}]
[null,null,null,{"$f":"IF(AND(P780>=1,type1=1),\"NB! Volum av nivåene kan ikke være større enn det totale volumet for hvert enkelt materiale!\",+IF(AND(P780>=1,type1=2),\"NB! Prosentandel for hvert nivå må registreres i prosent av det vurderte bygningselementet, og den totale prosentandelen kan ikke være større enn den totale prosent av hvert enkelt materiale!\",\"\"))","v":""},null,null,null,null,null,null,null,null,null,null,null,null,1,{"$f":"1","v":1}]
[null,null,{"$f":"IF(G769=\"\",\"\",IF(SUM(G771:G778)=0,\"\",IF(U769=1,IF(U769+L779=1,\"REGISTRER DET TOTALE VOLUMET AV RELEVANTE MATERIALER\",IF((U769+G779+L779)=1,\"REGISTRER DET TOTALE VOLUMET AV RELEVANTE MATERIALER\",IF(ISERROR(C780),\"REGISTRER DET TOTALE VOLUMET AV RELEVANTE MATERIALER\",IF(OR(G771>L779,G772>L779,G773>L779,G774>L779,G775>L779,G776>L779,G777>L779,G778>L779),\"Volumet av de enkelte materialer kan ikke overstige mengden relevante materialer\",IF(SUM(G771:G778)>L779,\"Den totale mengden av materialer kan ikke overstige det  totale volumet av relevante materialer\",\"\"))))),IF(U769=2,IF(SUM(G771:G778)<80,\"Minst 80 % av de relevante materialer må vurderes, vennligst beregn på nytt.\",IF(OR(G771>100,G772>100,G773>100,G774>100,G775>100,G776>100,G777>100,G778>100),\"Prosentandel av de enkelte materialerer kan ikke overstige 100\",IF(SUM(G771:G778)>100,\"Den totale prosentandelen av materialer kan ikke overstige 100\",\"\")))))))","v":""},null,"Mat. 1",null,null,null,null,null,null,null,{"$f":"IF(SUM(H787+I787+J787+K787+L787)>=3,\"3,00\",SUM(H787+I787+J787+K787+L787))","v":0},{"$f":"IF(AND(U769=1,L779=\"\"),0,IF(OR(NOT(D770=\"\"),NOT(C771=\"\"),NOT(N772=\"\")),0,IF(ISERROR(N780),\"0\",N780)))","v":0},null,{"$f":"IF(SUM(H771:L771)>G771,\"1\",\"0\")","v":"0"},1,{"$f":"1","v":1}]
[null,null,null,null,"Mat. 2",null,null,null,null,null,null,null,null,{"$f":"IF(AND(U769=1,L779=\"\"),C771,+IF(G780>L779,C771,(IF(N780<80,\"Ingen poeng oppnådd,\nmindre enn 80 % oppfyller kravet\",\"\"))))","v":""},null,{"$f":"IF(SUM(H772:L772)>G772,\"1\",\"0\")","v":"0"},1,{"$f":"1","v":1}]
[null,null,null,null,"Mat. 3",null,null,null,null,null,null,null,null,null,null,"0",1,{"$f":"1","v":1}]
[null,null,null,null,"Mat. 4",null,null,null,null,null,null,null,null,null,null,"0",1,{"$f":"1","v":1}]
[null,null,null,null,"Mat. 5",null,null,null,null,null,null,null,null,null,null,"0",1,{"$f":"1","v":1}]
[null,null,null,null,"Mat. 6",null,null,null,null,null,null,null,null,null,null,"0",1,{"$f":"1","v":1}]
[null,null,null,null,"Mat. 7",null,null,null,null,null,null,null,null,null,null,"0",1,{"$f":"1","v":1}]
[null,null,null,null,"Mat. 8",null,null,null,null,null,null,null,null,null,null,"0",1,{"$f":"1","v":1}]
[null,null,null,null,"Totalt % av bygningselementet (relevante materialer) vurdert:",null,{"$f":"IF(U769=\"\",0,IF(U769+L779=1,0,IF(SUM(G771:G778)=0,0,IF(U769=1,IF(OR(G771>L779,G772>L779,G773>L779,G774>L779,G775>L779,G776>L779,G777>L779,G778>L779,SUM(G771:G778)>L779),0,((SUM(G771:G778)/L779)*100)),IF(U769=2,IF(OR(G771>100,G772>100,G773>100,G774>100,G775>100,G776>100,G777>100,G778>100,SUM(G771:G778)>100),0,SUM(G771:G778)))))))","v":0},"Samlet volum for aktuelle elementer:",null,null,null,null,null,null,null,null,1,{"$f":"1","v":1}]
[null,null,{"$f":"IF(G779=0,\"0\",IF(U769=2,\"0\",IF(U769=1,(G779/100)*100,IF(U769=2,(G779/100)*100))))","v":"0"},{"$f":"G779","v":0},null,"Total",{"$f":"IF(SUM(G771:G778)=0,\"1\",SUM(G771:G778))","v":"1"},{"$f":"SUM(H771:H778)","v":0},{"$f":"SUM(I771:I778)","v":0},{"$f":"SUM(J771:J778)","v":0},{"$f":"SUM(K771:K778)","v":0},{"$f":"SUM(L771:L778)","v":0},null,{"$f":"SUM(H781:L781)","v":0},{"$f":"IF(G779<80,\"0,00\",IF(P780>0,\"0\",IF(G779>100,\"0,00\",IF(N771>=80,M771,IF(N771<80,0)))))","v":"0,00"},{"$f":"P771+P772+P773+P774+P775+P776+P777+P778","v":0},{"$f":"1","v":1},{"$f":"1","v":1}]
[null,null,null,null,null,null,"Percentage",{"$f":"IF(H780+G780=0,\"0\",(H780/G780)*100)","v":0},{"$f":"IF(I780+G780=0,\"0\",(I780/G780)*100)","v":0},{"$f":"IF(J780+G780=0,\"0\",(J780/G780)*100)","v":0},{"$f":"IF(K780+G780=0,\"0\",(K780/G780)*100)","v":0},{"$f":"IF(L780+G780=0,\"0\",(L780/G780)*100)","v":0},null,100,null,null,{"$f":"1","v":1},{"$f":"1","v":1}]
[null,null,null,null,null,{"$f":"IF(U769=1,((G780/100)*80))","v":false},"% of 80",{"$f":"(H781/80)*100","v":0},{"$f":"(I781/80)*100","v":0},{"$f":"(J781/80)*100","v":0},{"$f":"(K781/80)*100","v":0},{"$f":"(L781/80)*100","v":0},null,null,null,null,{"$f":"1","v":1},{"$f":"1","v":1}]
[null,null,null,null,null,null,"Limiter",{"$f":"IF(H782>100,\"100\",H782)","v":0},{"$f":"IF(I782>100,\"100\",I782)","v":0},{"$f":"IF(J782>100,\"100\",J782)","v":0},{"$f":"IF(K782>100,\"100\",K782)","v":0},{"$f":"IF(L782>100,\"100\",L782)","v":0},null,null,null,null,{"$f":"1","v":1},{"$f":"1","v":1}]
[null,null,null,null,null,null,null,null,{"$f":"IF(H783+I783+J783+K783+L783=0,0,100-(H783))","v":0},{"$f":"IF(H783+I783+J783+K783+L783=0,0,100-(H783+I783))","v":0},{"$f":"IF(J783+I783+H783+K783+L783=0,0,100-(J783+I783+H783))","v":0},{"$f":"IF(K783+J783+I783+H783+L783=0,0,100-(H783+I783+K783+J783))","v":0},null,null,null,null,{"$f":"1","v":1},{"$f":"1","v":1}]
[null,null,null,null,null,null,null,null,{"$f":"IF(I783>I784,I784,I783)","v":0},{"$f":"IF(J783>J784,J784,J783)","v":0},{"$f":"IF(K783>K784,K784,K783)","v":0},{"$f":"IF(L783>L784,L784,L783)","v":0},null,null,null,null,{"$f":"1","v":1},{"$f":"1","v":1}]
[null,null,null,null,null,null,null,null,null,null,null,{"$f":"IF(K785+J783+H783+I783>=100,0,L785)","v":0},null,null,null,null,{"$f":"1","v":1},{"$f":"1","v":1}]
[null,null,null,null,null,null,"Scores",{"$f":"IF(H780=0,0,0.01*(H783*H788))","v":0},{"$f":"IF(I780=0,0,0.01*(I785*I788))","v":0},{"$f":"IF(J780=0,0,0.01*(J785*J788))","v":0},{"$f":"IF(K780=0,0,0.01*(K785*K788))","v":0},{"$f":"IF(L780=0,0,0.01*(L786*L788))","v":0},null,null,null,null,{"$f":"1","v":1},{"$f":"1","v":1}]
[null,null,null,null,null,null,null,3,2.5,2,1.5,1,"Total",null,null,null,{"$f":"1","v":1},{"$f":"1","v":1}]
[null,null,"DØRER (3)",null,null,"Velg datatype:",null,null,null,null,null,null,null,null,null,null,{"$f":"IF(freq10>=5,0,1)","v":1},{"$f":"1","v":1},null,null,{"$f":"IF(G789=\"\",2,IF(ISERROR(VLOOKUP(G789,$T$1246:$U$1247,2,FALSE)),\"\",VLOOKUP(G789,$T$1246:$U$1247,2,FALSE)))","v":2}]
[null,null,null,{"$f":"IF(AND(P800>=1,type1=1),\"NB! Volum av nivåene kan ikke være større enn det totale volumet for hvert enkelt materiale!\",+IF(AND(P800>=1,type1=2),\"NB! Prosentandel for hvert nivå må registreres i prosent av det vurderte bygningselementet, og den totale prosentandelen kan ikke være større enn den totale prosent av hvert enkelt materiale!\",\"\"))","v":""},null,null,null,null,null,null,null,null,null,null,null,null,1,{"$f":"1","v":1}]
[null,null,{"$f":"IF(G789=\"\",\"\",IF(SUM(G791:G798)=0,\"\",IF(U789=1,IF(U789+L799=1,\"REGISTRER DET TOTALE VOLUMET AV RELEVANTE MATERIALER\",IF((U789+G799+L799)=1,\"REGISTRER DET TOTALE VOLUMET AV RELEVANTE MATERIALER\",IF(ISERROR(C800),\"REGISTRER DET TOTALE VOLUMET AV RELEVANTE MATERIALER\",IF(OR(G791>L799,G792>L799,G793>L799,G794>L799,G795>L799,G796>L799,G797>L799,G798>L799),\"Volumet av de enkelte materialer kan ikke overstige mengden relevante materialer\",IF(SUM(G791:G798)>L799,\"Den totale mengden av materialer kan ikke overstige det  totale volumet av relevante materialer\",\"\"))))),IF(U789=2,IF(SUM(G791:G798)<80,\"Minst 80 % av de relevante materialer må vurderes, vennligst beregn på nytt.\",IF(OR(G791>100,G792>100,G793>100,G794>100,G795>100,G796>100,G797>100,G798>100),\"Prosentandel av de enkelte materialerer kan ikke overstige 100\",IF(SUM(G791:G798)>100,\"Den totale prosentandelen av materialer kan ikke overstige 100\",\"\")))))))","v":""},null,"Mat. 1",null,null,null,null,null,null,null,{"$f":"IF(SUM(H807+I807+J807+K807+L807)>=3,\"3,00\",SUM(H807+I807+J807+K807+L807))","v":0},{"$f":"IF(AND(U789=1,L799=\"\"),0,IF(OR(NOT(D790=\"\"),NOT(C791=\"\"),NOT(N792=\"\")),0,IF(ISERROR(N800),\"0\",N800)))","v":0},null,{"$f":"IF(SUM(H791:L791)>G791,\"1\",\"0\")","v":"0"},1,{"$f":"1","v":1}]
[null,null,null,null,"Mat. 2",null,null,null,null,null,null,null,null,{"$f":"IF(AND(U789=1,L799=\"\"),C791,+IF(G800>L799,C791,(IF(N800<80,\"Ingen poeng oppnådd,\nmindre enn 80 % oppfyller kravet\",\"\"))))","v":""},null,{"$f":"IF(SUM(H792:L792)>G792,\"1\",\"0\")","v":"0"},1,{"$f":"1","v":1}]
[null,null,null,null,"Mat. 3",null,null,null,null,null,null,null,null,null,null,"0",1,{"$f":"1","v":1}]
[null,null,null,null,"Mat. 4",null,null,null,null,null,null,null,null,null,null,"0",1,{"$f":"1","v":1}]
[null,null,null,null,"Mat. 5",null,null,null,null,null,null,null,null,null,null,"0",1,{"$f":"1","v":1}]
[null,null,null,null,"Mat. 6",null,null,null,null,null,null,null,null,null,null,"0",1,{"$f":"1","v":1}]
[null,null,null,null,"Mat. 7",null,null,null,null,null,null,null,null,null,null,"0",1,{"$f":"1","v":1}]
[null,null,null,null,"Mat. 8",null,null,null,null,null,null,null,null,null,null,"0",1,{"$f":"1","v":1}]
[null,null,null,null,"Totalt % av bygningselementet (relevante materialer) vurdert:",null,{"$f":"IF(U789=\"\",0,IF(U789+L799=1,0,IF(SUM(G791:G798)=0,0,IF(U789=1,IF(OR(G791>L799,G792>L799,G793>L799,G794>L799,G795>L799,G796>L799,G797>L799,G798>L799,SUM(G791:G798)>L799),0,((SUM(G791:G798)/L799)*100)),IF(U789=2,IF(OR(G791>100,G792>100,G793>100,G794>100,G795>100,G796>100,G797>100,G798>100,SUM(G791:G798)>100),0,SUM(G791:G798)))))))","v":0},"Samlet volum for aktuelle elementer:",null,null,null,null,null,null,null,null,1,{"$f":"1","v":1}]
[null,null,{"$f":"IF(G799=0,\"0\",IF(U789=2,\"0\",IF(U789=1,(G799/100)*100,IF(U789=2,(G799/100)*100))))","v":"0"},{"$f":"G799","v":0},null,"Total",{"$f":"IF(SUM(G791:G798)=0,\"1\",SUM(G791:G798))","v":"1"},{"$f":"SUM(H791:H798)","v":0},{"$f":"SUM(I791:I798)","v":0},{"$f":"SUM(J791:J798)","v":0},{"$f":"SUM(K791:K798)","v":0},{"$f":"SUM(L791:L798)","v":0},null,{"$f":"SUM(H801:L801)","v":0},{"$f":"IF(G799<80,\"0,00\",IF(P800>0,\"0\",IF(G799>100,\"0,00\",IF(N791>=80,M791,IF(N791<80,0)))))","v":"0,00"},{"$f":"P791+P792+P793+P794+P795+P796+P797+P798","v":0},{"$f":"1","v":1},{"$f":"1","v":1}]
[null,null,null,null,null,null,"Percentage",{"$f":"IF(H800+G800=0,\"0\",(H800/G800)*100)","v":0},{"$f":"IF(I800+G800=0,\"0\",(I800/G800)*100)","v":0},{"$f":"IF(J800+G800=0,\"0\",(J800/G800)*100)","v":0},{"$f":"IF(K800+G800=0,\"0\",(K800/G800)*100)","v":0},{"$f":"IF(L800+G800=0,\"0\",(L800/G800)*100)","v":0},null,100,null,null,{"$f":"1","v":1},{"$f":"1","v":1}]
[null,null,null,null,null,{"$f":"IF(U789=1,((G800/100)*80))","v":false},"% of 80",{"$f":"(H801/80)*100","v":0},{"$f":"(I801/80)*100","v":0},{"$f":"(J801/80)*100","v":0},{"$f":"(K801/80)*100","v":0},{"$f":"(L801/80)*100","v":0},null,null,null,null,{"$f":"1","v":1},{"$f":"1","v":1}]
[null,null,null,null,null,null,"Limiter",{"$f":"IF(H802>100,\"100\",H802)","v":0},{"$f":"IF(I802>100,\"100\",I802)","v":0},{"$f":"IF(J802>100,\"100\",J802)","v":0},{"$f":"IF(K802>100,\"100\",K802)","v":0},{"$f":"IF(L802>100,\"100\",L802)","v":0},null,null,null,null,{"$f":"1","v":1},{"$f":"1","v":1}]
[null,null,null,null,null,null,null,null,{"$f":"IF(H803+I803+J803+K803+L803=0,0,100-(H803))","v":0},{"$f":"IF(H803+I803+J803+K803+L803=0,0,100-(H803+I803))","v":0},{"$f":"IF(J803+I803+H803+K803+L803=0,0,100-(J803+I803+H803))","v":0},{"$f":"IF(K803+J803+I803+H803+L803=0,0,100-(H803+I803+K803+J803))","v":0},null,null,null,null,{"$f":"1","v":1},{"$f":"1","v":1}]
[null,null,null,null,null,null,null,null,{"$f":"IF(I803>I804,I804,I803)","v":0},{"$f":"IF(J803>J804,J804,J803)","v":0},{"$f":"IF(K803>K804,K804,K803)","v":0},{"$f":"IF(L803>L804,L804,L803)","v":0},null,null,null,null,{"$f":"1","v":1},{"$f":"1","v":1}]
[null,null,null,null,null,null,null,null,null,null,null,{"$f":"IF(K805+J803+H803+I803>=100,0,L805)","v":0},null,null,null,null,{"$f":"1","v":1},{"$f":"1","v":1}]
[null,null,null,null,null,null,"Scores",{"$f":"IF(H800=0,0,0.01*(H803*H808))","v":0},{"$f":"IF(I800=0,0,0.01*(I805*I808))","v":0},{"$f":"IF(J800=0,0,0.01*(J805*J808))","v":0},{"$f":"IF(K800=0,0,0.01*(K805*K808))","v":0},{"$f":"IF(L800=0,0,0.01*(L806*L808))","v":0},null,null,null,null,{"$f":"1","v":1},{"$f":"1","v":1}]
[null,null,null,null,null,null,null,3,2.5,2,1.5,1,"Total",null,null,null,{"$f":"1","v":1},{"$f":"1","v":1}]
[null,null,"DØRER (4)",null,null,"Velg datatype:",null,null,null,null,null,null,null,null,null,null,{"$f":"IF(freq10>=6,0,1)","v":1},{"$f":"1","v":1},null,null,{"$f":"IF(G809=\"\",2,IF(ISERROR(VLOOKUP(G809,$T$1246:$U$1247,2,FALSE)),\"\",VLOOKUP(G809,$T$1246:$U$1247,2,FALSE)))","v":2}]
[null,null,null,{"$f":"IF(AND(P820>=1,type1=1),\"NB! Volum av nivåene kan ikke være større enn det totale volumet for hvert enkelt materiale!\",+IF(AND(P820>=1,type1=2),\"NB! Prosentandel for hvert nivå må registreres i prosent av det vurderte bygningselementet, og den totale prosentandelen kan ikke være større enn den totale prosent av hvert enkelt materiale!\",\"\"))","v":""},null,null,null,null,null,null,null,null,null,null,null,null,1,{"$f":"1","v":1}]
[null,null,{"$f":"IF(G809=\"\",\"\",IF(SUM(G811:G818)=0,\"\",IF(U809=1,IF(U809+L819=1,\"REGISTRER DET TOTALE VOLUMET AV RELEVANTE MATERIALER\",IF((U809+G819+L819)=1,\"REGISTRER DET TOTALE VOLUMET AV RELEVANTE MATERIALER\",IF(ISERROR(C820),\"REGISTRER DET TOTALE VOLUMET AV RELEVANTE MATERIALER\",IF(OR(G811>L819,G812>L819,G813>L819,G814>L819,G815>L819,G816>L819,G817>L819,G818>L819),\"Volumet av de enkelte materialer kan ikke overstige mengden relevante materialer\",IF(SUM(G811:G818)>L819,\"Den totale mengden av materialer kan ikke overstige det  totale volumet av relevante materialer\",\"\"))))),IF(U809=2,IF(SUM(G811:G818)<80,\"Minst 80 % av de relevante materialer må vurderes, vennligst beregn på nytt.\",IF(OR(G811>100,G812>100,G813>100,G814>100,G815>100,G816>100,G817>100,G818>100),\"Prosentandel av de enkelte materialerer kan ikke overstige 100\",IF(SUM(G811:G818)>100,\"Den totale prosentandelen av materialer kan ikke overstige 100\",\"\")))))))","v":""},null,"Mat. 1",null,null,null,null,null,null,null,{"$f":"IF(SUM(H827+I827+J827+K827+L827)>=3,\"3,00\",SUM(H827+I827+J827+K827+L827))","v":0},{"$f":"IF(AND(U809=1,L819=\"\"),0,IF(OR(NOT(D810=\"\"),NOT(C811=\"\"),NOT(N812=\"\")),0,IF(ISERROR(N820),\"0\",N820)))","v":0},null,{"$f":"IF(SUM(H811:L811)>G811,\"1\",\"0\")","v":"0"},1,{"$f":"1","v":1}]
[null,null,null,null,"Mat. 2",null,null,null,null,null,null,null,null,{"$f":"IF(AND(U809=1,L819=\"\"),C811,+IF(G820>L819,C811,(IF(N820<80,\"Ingen poeng oppnådd,\nmindre enn 80 % oppfyller kravet\",\"\"))))","v":""},null,{"$f":"IF(SUM(H812:L812)>G812,\"1\",\"0\")","v":"0"},1,{"$f":"1","v":1}]
[null,null,null,null,"Mat. 3",null,null,null,null,null,null,null,null,null,null,"0",1,{"$f":"1","v":1}]
[null,null,null,null,"Mat. 4",null,null,null,null,null,null,null,null,null,null,"0",1,{"$f":"1","v":1}]
[null,null,null,null,"Mat. 5",null,null,null,null,null,null,null,null,null,null,"0",1,{"$f":"1","v":1}]
[null,null,null,null,"Mat. 6",null,null,null,null,null,null,null,null,null,null,"0",1,{"$f":"1","v":1}]
[null,null,null,null,"Mat. 7",null,null,null,null,null,null,null,null,null,null,"0",1,{"$f":"1","v":1}]
[null,null,null,null,"Mat. 8",null,null,null,null,null,null,null,null,null,null,"0",1,{"$f":"1","v":1}]
[null,null,null,null,"Totalt % av bygningselementet (relevante materialer) vurdert:",null,{"$f":"IF(U809=\"\",0,IF(U809+L819=1,0,IF(SUM(G811:G818)=0,0,IF(U809=1,IF(OR(G811>L819,G812>L819,G813>L819,G814>L819,G815>L819,G816>L819,G817>L819,G818>L819,SUM(G811:G818)>L819),0,((SUM(G811:G818)/L819)*100)),IF(U809=2,IF(OR(G811>100,G812>100,G813>100,G814>100,G815>100,G816>100,G817>100,G818>100,SUM(G811:G818)>100),0,SUM(G811:G818)))))))","v":0},"Samlet volum for aktuelle elementer:",null,null,null,null,null,null,null,null,1,{"$f":"1","v":1}]
[null,null,{"$f":"IF(G819=0,\"0\",IF(U809=2,\"0\",IF(U809=1,(G819/100)*100,IF(U809=2,(G819/100)*100))))","v":"0"},{"$f":"G819","v":0},null,"Total",{"$f":"IF(SUM(G811:G818)=0,\"1\",SUM(G811:G818))","v":"1"},{"$f":"SUM(H811:H818)","v":0},{"$f":"SUM(I811:I818)","v":0},{"$f":"SUM(J811:J818)","v":0},{"$f":"SUM(K811:K818)","v":0},{"$f":"SUM(L811:L818)","v":0},null,{"$f":"SUM(H821:L821)","v":0},{"$f":"IF(G819<80,\"0,00\",IF(P820>0,\"0\",IF(G819>100,\"0,00\",IF(N811>=80,M811,IF(N811<80,0)))))","v":"0,00"},{"$f":"P811+P812+P813+P814+P815+P816+P817+P818","v":0},{"$f":"1","v":1},{"$f":"1","v":1}]
[null,null,null,null,null,null,"Percentage",{"$f":"IF(H820+G820=0,\"0\",(H820/G820)*100)","v":0},{"$f":"IF(I820+G820=0,\"0\",(I820/G820)*100)","v":0},{"$f":"IF(J820+G820=0,\"0\",(J820/G820)*100)","v":0},{"$f":"IF(K820+G820=0,\"0\",(K820/G820)*100)","v":0},{"$f":"IF(L820+G820=0,\"0\",(L820/G820)*100)","v":0},null,100,null,null,{"$f":"1","v":1},{"$f":"1","v":1}]
[null,null,null,null,null,{"$f":"IF(U809=1,((G820/100)*80))","v":false},"% of 80",{"$f":"(H821/80)*100","v":0},{"$f":"(I821/80)*100","v":0},{"$f":"(J821/80)*100","v":0},{"$f":"(K821/80)*100","v":0},{"$f":"(L821/80)*100","v":0},null,null,null,null,{"$f":"1","v":1},{"$f":"1","v":1}]
[null,null,null,null,null,null,"Limiter",{"$f":"IF(H822>100,\"100\",H822)","v":0},{"$f":"IF(I822>100,\"100\",I822)","v":0},{"$f":"IF(J822>100,\"100\",J822)","v":0},{"$f":"IF(K822>100,\"100\",K822)","v":0},{"$f":"IF(L822>100,\"100\",L822)","v":0},null,null,null,null,{"$f":"1","v":1},{"$f":"1","v":1}]
[null,null,null,null,null,null,null,null,{"$f":"IF(H823+I823+J823+K823+L823=0,0,100-(H823))","v":0},{"$f":"IF(H823+I823+J823+K823+L823=0,0,100-(H823+I823))","v":0},{"$f":"IF(J823+I823+H823+K823+L823=0,0,100-(J823+I823+H823))","v":0},{"$f":"IF(K823+J823+I823+H823+L823=0,0,100-(H823+I823+K823+J823))","v":0},null,null,null,null,{"$f":"1","v":1},{"$f":"1","v":1}]
[null,null,null,null,null,null,null,null,{"$f":"IF(I823>I824,I824,I823)","v":0},{"$f":"IF(J823>J824,J824,J823)","v":0},{"$f":"IF(K823>K824,K824,K823)","v":0},{"$f":"IF(L823>L824,L824,L823)","v":0},null,null,null,null,{"$f":"1","v":1},{"$f":"1","v":1}]
[null,null,null,null,null,null,null,null,null,null,null,{"$f":"IF(K825+J823+H823+I823>=100,0,L825)","v":0},null,null,null,null,{"$f":"1","v":1},{"$f":"1","v":1}]
[null,null,null,null,null,null,"Scores",{"$f":"IF(H820=0,0,0.01*(H823*H828))","v":0},{"$f":"IF(I820=0,0,0.01*(I825*I828))","v":0},{"$f":"IF(J820=0,0,0.01*(J825*J828))","v":0},{"$f":"IF(K820=0,0,0.01*(K825*K828))","v":0},{"$f":"IF(L820=0,0,0.01*(L826*L828))","v":0},null,null,null,null,{"$f":"1","v":1},{"$f":"1","v":1}]
[null,null,null,null,null,null,null,3,2.5,2,1.5,1,"Total",null,null,null,{"$f":"1","v":1},{"$f":"1","v":1}]
[null,null,"GULVLISTER",null,null,"Velg antall gulvlister du ønsker å vurdere (deretter trykk «velg»):",null,null,null,null,{"$f":"IF(AND(G829=\"\",G840>0),\"NB! Husk å velge antall elementer...\",\"\")","v":""},null,null,null,{"$f":"IF(ISERROR(O841+O861+O881+O901)/V830,\"\",(O841+O861+O881+O901)/V830)","v":0},null,{"$f":"0","v":0},{"$f":"IF(asstype=3,0,IF(typescheme=2,0,1))","v":1},null,{"$f":"VLOOKUP(G829,$T$1239:$U$1243,2,FALSE)","v":2}]
[null,null,{"$f":"IF(G829=\"\",\"GULVLISTER\",\"GULVLISTER (1)\")","v":"GULVLISTER"},null,null,"Velg datatype:",null,null,null,null,null,null,null,null,null,null,{"$f":"IF(freq11>=3,0,1)","v":1},1,null,null,{"$f":"IF(G830=\"\",2,IF(ISERROR(VLOOKUP(G830,$T$1246:$U$1247,2,FALSE)),\"\",VLOOKUP(G830,$T$1246:$U$1247,2,FALSE)))","v":2},{"$f":"IF(freq11=3,1,IF(freq11=4,2,IF(freq11=5,3,IF(freq11=6,4,1))))","v":1}]
[null,null,null,{"$f":"IF(AND(P841>=1,type1=1),\"NB! Volum av nivåene kan ikke være større enn det totale volumet for hvert enkelt materiale!\",+IF(AND(P841>=1,type1=2),\"NB! Prosentandel for hvert nivå må registreres i prosent av det vurderte bygningselementet, og den totale prosentandelen kan ikke være større enn den totale prosent av hvert enkelt materiale!\",\"\"))","v":""},null,null,null,null,null,null,null,null,null,null,null,null,1,1]
[null,null,{"$f":"IF(G830=\"\",\"\",IF(SUM(G832:G839)=0,\"\",IF(U830=1,IF(U830+L840=1,\"REGISTRER DET TOTALE VOLUMET AV RELEVANTE MATERIALER\",IF((U830+G840+L840)=1,\"REGISTRER DET TOTALE VOLUMET AV RELEVANTE MATERIALER\",IF(ISERROR(C841),\"REGISTRER DET TOTALE VOLUMET AV RELEVANTE MATERIALER\",IF(OR(G832>L840,G833>L840,G834>L840,G835>L840,G836>L840,G837>L840,G838>L840,G839>L840),\"Volumet av de enkelte materialer kan ikke overstige mengden relevante materialer\",IF(SUM(G832:G839)>L840,\"Den totale mengden av materialer kan ikke overstige det  totale volumet av relevante materialer\",\"\"))))),IF(U830=2,IF(SUM(G832:G839)<80,\"Minst 80 % av de relevante materialer må vurderes, vennligst beregn på nytt.\",IF(OR(G832>100,G833>100,G834>100,G835>100,G836>100,G837>100,G838>100,G839>100),\"Prosentandel av de enkelte materialerer kan ikke overstige 100\",IF(SUM(G832:G839)>100,\"Den totale prosentandelen av materialer kan ikke overstige 100\",\"\")))))))","v":""},null,"Mat. 1",null,null,null,null,null,null,null,{"$f":"IF(SUM(H848+I848+J848+K848+L848)>=3,\"3,00\",SUM(H848+I848+J848+K848+L848))","v":0},{"$f":"IF(AND(U830=1,L840=\"\"),0,IF(OR(NOT(D831=\"\"),NOT(C832=\"\"),NOT(N833=\"\")),0,IF(ISERROR(N841),\"0\",N841)))","v":0},null,{"$f":"IF(SUM(H832:L832)>G832,\"1\",\"0\")","v":"0"},1,1]
[null,null,null,null,"Mat. 2",null,null,null,null,null,null,null,null,{"$f":"IF(AND(U830=1,L840=\"\"),C832,+IF(G841>L840,C832,(IF(N841<80,\"Ingen poeng oppnådd,\nmindre enn 80 % oppfyller kravet\",\"\"))))","v":""},null,{"$f":"IF(SUM(H833:L833)>G833,\"1\",\"0\")","v":"0"},1,1]
[null,null,null,null,"Mat. 3",null,null,null,null,null,null,null,null,null,null,"0",1,1]
[null,null,null,null,"Mat. 4",null,null,null,null,null,null,null,null,null,null,"0",1,1]
[null,null,null,null,"Mat. 5",null,null,null,null,null,null,null,null,null,null,"0",1,1]
[null,null,null,null,"Mat. 6",null,null,null,null,null,null,null,null,null,null,"0",1,1]
[null,null,null,null,"Mat. 7",null,null,null,null,null,null,null,null,null,null,"0",1,1]
[null,null,null,null,"Mat. 8",null,null,null,null,null,null,null,null,null,null,"0",1,1]
[null,null,null,null,"Totalt % av bygningselementet (relevante materialer) vurdert:",null,{"$f":"IF(U830=\"\",0,IF(U830+L840=1,0,IF(SUM(G832:G839)=0,0,IF(U830=1,IF(OR(G832>L840,G833>L840,G834>L840,G835>L840,G836>L840,G837>L840,G838>L840,G839>L840,SUM(G832:G839)>L840),0,((SUM(G832:G839)/L840)*100)),IF(U830=2,IF(OR(G832>100,G833>100,G834>100,G835>100,G836>100,G837>100,G838>100,G839>100,SUM(G832:G839)>100),0,SUM(G832:G839)))))))","v":0},"Samlet volum for aktuelle elementer:",null,null,null,null,null,null,null,null,1,1]
[null,null,{"$f":"IF(G840=0,\"0\",IF(U833=2,\"0\",IF(U833=1,(G840/100)*100,IF(U833=2,(G840/100)*100))))","v":"0"},{"$f":"G840","v":0},null,"Total",{"$f":"IF(SUM(G832:G839)=0,\"1\",SUM(G832:G839))","v":"1"},{"$f":"SUM(H832:H839)","v":0},{"$f":"SUM(I832:I839)","v":0},{"$f":"SUM(J832:J839)","v":0},{"$f":"SUM(K832:K839)","v":0},{"$f":"SUM(L832:L839)","v":0},null,{"$f":"SUM(H842:L842)","v":0},{"$f":"IF(G840<80,\"0,00\",IF(P841>0,\"0\",IF(G840>100,\"0,00\",IF(N832>=80,M832,IF(N832<80,0)))))","v":"0,00"},{"$f":"P832+P833+P834+P835+P836+P837+P838+P839","v":0},{"$f":"1","v":1},{"$f":"1","v":1}]
[null,null,null,null,null,null,"Percentage",{"$f":"IF(H841+G841=0,\"0\",(H841/G841)*100)","v":0},{"$f":"IF(I841+G841=0,\"0\",(I841/G841)*100)","v":0},{"$f":"IF(J841+G841=0,\"0\",(J841/G841)*100)","v":0},{"$f":"IF(K841+G841=0,\"0\",(K841/G841)*100)","v":0},{"$f":"IF(L841+G841=0,\"0\",(L841/G841)*100)","v":0},null,100,null,null,{"$f":"1","v":1},{"$f":"1","v":1}]
[null,null,null,null,null,{"$f":"IF(U833=1,((G841/100)*80))","v":false},"% of 80",{"$f":"(H842/80)*100","v":0},{"$f":"(I842/80)*100","v":0},{"$f":"(J842/80)*100","v":0},{"$f":"(K842/80)*100","v":0},{"$f":"(L842/80)*100","v":0},null,null,null,null,{"$f":"1","v":1},{"$f":"1","v":1}]
[null,null,null,null,null,null,"Limiter",{"$f":"IF(H843>100,\"100\",H843)","v":0},{"$f":"IF(I843>100,\"100\",I843)","v":0},{"$f":"IF(J843>100,\"100\",J843)","v":0},{"$f":"IF(K843>100,\"100\",K843)","v":0},{"$f":"IF(L843>100,\"100\",L843)","v":0},null,null,null,null,{"$f":"1","v":1},{"$f":"1","v":1}]
[null,null,null,null,null,null,null,null,{"$f":"IF(H844+I844+J844+K844+L844=0,0,100-(H844))","v":0},{"$f":"IF(H844+I844+J844+K844+L844=0,0,100-(H844+I844))","v":0},{"$f":"IF(J844+I844+H844+K844+L844=0,0,100-(J844+I844+H844))","v":0},{"$f":"IF(K844+J844+I844+H844+L844=0,0,100-(H844+I844+K844+J844))","v":0},null,null,null,null,{"$f":"1","v":1},{"$f":"1","v":1}]
[null,null,null,null,null,null,null,null,{"$f":"IF(I844>I845,I845,I844)","v":0},{"$f":"IF(J844>J845,J845,J844)","v":0},{"$f":"IF(K844>K845,K845,K844)","v":0},{"$f":"IF(L844>L845,L845,L844)","v":0},null,null,null,null,{"$f":"1","v":1},{"$f":"1","v":1}]
[null,null,null,null,null,null,null,null,null,null,null,{"$f":"IF(K846+J844+H844+I844>=100,0,L846)","v":0},null,null,null,null,{"$f":"1","v":1},{"$f":"1","v":1}]
[null,null,null,null,null,null,"Scores",{"$f":"IF(H841=0,0,0.01*(H844*H849))","v":0},{"$f":"IF(I841=0,0,0.01*(I846*I849))","v":0},{"$f":"IF(J841=0,0,0.01*(J846*J849))","v":0},{"$f":"IF(K841=0,0,0.01*(K846*K849))","v":0},{"$f":"IF(L841=0,0,0.01*(L847*L849))","v":0},null,null,null,null,{"$f":"1","v":1},{"$f":"1","v":1}]
[null,null,null,null,null,null,null,3,2.5,2,1.5,1,"Total",null,null,null,{"$f":"1","v":1},{"$f":"1","v":1}]
[null,null,"GULVLISTER (2)",null,null,"Velg datatype:",null,null,null,null,null,null,null,null,null,null,{"$f":"IF(freq11>=4,0,1)","v":1},{"$f":"1","v":1},null,null,{"$f":"IF(G850=\"\",2,IF(ISERROR(VLOOKUP(G850,$T$1246:$U$1247,2,FALSE)),\"\",VLOOKUP(G850,$T$1246:$U$1247,2,FALSE)))","v":2}]
[null,null,null,{"$f":"IF(AND(P861>=1,type1=1),\"NB! Volum av nivåene kan ikke være større enn det totale volumet for hvert enkelt materiale!\",+IF(AND(P861>=1,type1=2),\"NB! Prosentandel for hvert nivå må registreres i prosent av det vurderte bygningselementet, og den totale prosentandelen kan ikke være større enn den totale prosent av hvert enkelt materiale!\",\"\"))","v":""},null,null,null,null,null,null,null,null,null,null,null,null,1,{"$f":"1","v":1}]
[null,null,{"$f":"IF(G850=\"\",\"\",IF(SUM(G852:G859)=0,\"\",IF(U850=1,IF(U850+L860=1,\"REGISTRER DET TOTALE VOLUMET AV RELEVANTE MATERIALER\",IF((U850+G860+L860)=1,\"REGISTRER DET TOTALE VOLUMET AV RELEVANTE MATERIALER\",IF(ISERROR(C861),\"REGISTRER DET TOTALE VOLUMET AV RELEVANTE MATERIALER\",IF(OR(G852>L860,G853>L860,G854>L860,G855>L860,G856>L860,G857>L860,G858>L860,G859>L860),\"Volumet av de enkelte materialer kan ikke overstige mengden relevante materialer\",IF(SUM(G852:G859)>L860,\"Den totale mengden av materialer kan ikke overstige det  totale volumet av relevante materialer\",\"\"))))),IF(U850=2,IF(SUM(G852:G859)<80,\"Minst 80 % av de relevante materialer må vurderes, vennligst beregn på nytt.\",IF(OR(G852>100,G853>100,G854>100,G855>100,G856>100,G857>100,G858>100,G859>100),\"Prosentandel av de enkelte materialerer kan ikke overstige 100\",IF(SUM(G852:G859)>100,\"Den totale prosentandelen av materialer kan ikke overstige 100\",\"\")))))))","v":""},null,"Mat. 1",null,null,null,null,null,null,null,{"$f":"IF(SUM(H868+I868+J868+K868+L868)>=3,\"3,00\",SUM(H868+I868+J868+K868+L868))","v":0},{"$f":"IF(AND(U850=1,L860=\"\"),0,IF(OR(NOT(D851=\"\"),NOT(C852=\"\"),NOT(N853=\"\")),0,IF(ISERROR(N861),\"0\",N861)))","v":0},null,{"$f":"IF(SUM(H852:L852)>G852,\"1\",\"0\")","v":"0"},1,{"$f":"1","v":1}]
[null,null,null,null,"Mat. 2",null,null,null,null,null,null,null,null,{"$f":"IF(AND(U850=1,L860=\"\"),C852,+IF(G861>L860,C852,(IF(N861<80,\"Ingen poeng oppnådd,\nmindre enn 80 % oppfyller kravet\",\"\"))))","v":""},null,{"$f":"IF(SUM(H853:L853)>G853,\"1\",\"0\")","v":"0"},1,{"$f":"1","v":1}]
[null,null,null,null,"Mat. 3",null,null,null,null,null,null,null,null,null,null,"0",1,{"$f":"1","v":1}]
[null,null,null,null,"Mat. 4",null,null,null,null,null,null,null,null,null,null,"0",1,{"$f":"1","v":1}]
[null,null,null,null,"Mat. 5",null,null,null,null,null,null,null,null,null,null,"0",1,{"$f":"1","v":1}]
[null,null,null,null,"Mat. 6",null,null,null,null,null,null,null,null,null,null,"0",1,{"$f":"1","v":1}]
[null,null,null,null,"Mat. 7",null,null,null,null,null,null,null,null,null,null,"0",1,{"$f":"1","v":1}]
[null,null,null,null,"Mat. 8",null,null,null,null,null,null,null,null,null,null,"0",1,{"$f":"1","v":1}]
[null,null,null,null,"Totalt % av bygningselementet (relevante materialer) vurdert:",null,{"$f":"IF(U850=\"\",0,IF(U850+L860=1,0,IF(SUM(G852:G859)=0,0,IF(U850=1,IF(OR(G852>L860,G853>L860,G854>L860,G855>L860,G856>L860,G857>L860,G858>L860,G859>L860,SUM(G852:G859)>L860),0,((SUM(G852:G859)/L860)*100)),IF(U850=2,IF(OR(G852>100,G853>100,G854>100,G855>100,G856>100,G857>100,G858>100,G859>100,SUM(G852:G859)>100),0,SUM(G852:G859)))))))","v":0},"Samlet volum for aktuelle elementer:",null,null,null,null,null,null,null,null,1,{"$f":"1","v":1}]
[null,null,{"$f":"IF(G860=0,\"0\",IF(U850=2,\"0\",IF(U850=1,(G860/100)*100,IF(U850=2,(G860/100)*100))))","v":"0"},{"$f":"G860","v":0},null,"Total",{"$f":"IF(SUM(G852:G859)=0,\"1\",SUM(G852:G859))","v":"1"},{"$f":"SUM(H852:H859)","v":0},{"$f":"SUM(I852:I859)","v":0},{"$f":"SUM(J852:J859)","v":0},{"$f":"SUM(K852:K859)","v":0},{"$f":"SUM(L852:L859)","v":0},null,{"$f":"SUM(H862:L862)","v":0},{"$f":"IF(G860<80,\"0,00\",IF(P861>0,\"0\",IF(G860>100,\"0,00\",IF(N852>=80,M852,IF(N852<80,0)))))","v":"0,00"},{"$f":"P852+P853+P854+P855+P856+P857+P858+P859","v":0},{"$f":"1","v":1},{"$f":"1","v":1}]
[null,null,null,null,null,null,"Percentage",{"$f":"IF(H861+G861=0,\"0\",(H861/G861)*100)","v":0},{"$f":"IF(I861+G861=0,\"0\",(I861/G861)*100)","v":0},{"$f":"IF(J861+G861=0,\"0\",(J861/G861)*100)","v":0},{"$f":"IF(K861+G861=0,\"0\",(K861/G861)*100)","v":0},{"$f":"IF(L861+G861=0,\"0\",(L861/G861)*100)","v":0},null,100,null,null,{"$f":"1","v":1},{"$f":"1","v":1}]
[null,null,null,null,null,{"$f":"IF(U850=1,((G861/100)*80))","v":false},"% of 80",{"$f":"(H862/80)*100","v":0},{"$f":"(I862/80)*100","v":0},{"$f":"(J862/80)*100","v":0},{"$f":"(K862/80)*100","v":0},{"$f":"(L862/80)*100","v":0},null,null,null,null,{"$f":"1","v":1},{"$f":"1","v":1}]
[null,null,null,null,null,null,"Limiter",{"$f":"IF(H863>100,\"100\",H863)","v":0},{"$f":"IF(I863>100,\"100\",I863)","v":0},{"$f":"IF(J863>100,\"100\",J863)","v":0},{"$f":"IF(K863>100,\"100\",K863)","v":0},{"$f":"IF(L863>100,\"100\",L863)","v":0},null,null,null,null,{"$f":"1","v":1},{"$f":"1","v":1}]
[null,null,null,null,null,null,null,null,{"$f":"IF(H864+I864+J864+K864+L864=0,0,100-(H864))","v":0},{"$f":"IF(H864+I864+J864+K864+L864=0,0,100-(H864+I864))","v":0},{"$f":"IF(J864+I864+H864+K864+L864=0,0,100-(J864+I864+H864))","v":0},{"$f":"IF(K864+J864+I864+H864+L864=0,0,100-(H864+I864+K864+J864))","v":0},null,null,null,null,{"$f":"1","v":1},{"$f":"1","v":1}]
[null,null,null,null,null,null,null,null,{"$f":"IF(I864>I865,I865,I864)","v":0},{"$f":"IF(J864>J865,J865,J864)","v":0},{"$f":"IF(K864>K865,K865,K864)","v":0},{"$f":"IF(L864>L865,L865,L864)","v":0},null,null,null,null,{"$f":"1","v":1},{"$f":"1","v":1}]
[null,null,null,null,null,null,null,null,null,null,null,{"$f":"IF(K866+J864+H864+I864>=100,0,L866)","v":0},null,null,null,null,{"$f":"1","v":1},{"$f":"1","v":1}]
[null,null,null,null,null,null,"Scores",{"$f":"IF(H861=0,0,0.01*(H864*H869))","v":0},{"$f":"IF(I861=0,0,0.01*(I866*I869))","v":0},{"$f":"IF(J861=0,0,0.01*(J866*J869))","v":0},{"$f":"IF(K861=0,0,0.01*(K866*K869))","v":0},{"$f":"IF(L861=0,0,0.01*(L867*L869))","v":0},null,null,null,null,{"$f":"1","v":1},{"$f":"1","v":1}]
[null,null,null,null,null,null,null,3,2.5,2,1.5,1,"Total",null,null,null,{"$f":"1","v":1},{"$f":"1","v":1}]
[null,null,"GULVLISTER (3)",null,null,"Velg datatype:",null,null,null,null,null,null,null,null,null,null,{"$f":"IF(freq11>=5,0,1)","v":1},{"$f":"1","v":1},null,null,{"$f":"IF(G870=\"\",2,IF(ISERROR(VLOOKUP(G870,$T$1246:$U$1247,2,FALSE)),\"\",VLOOKUP(G870,$T$1246:$U$1247,2,FALSE)))","v":2}]
[null,null,null,{"$f":"IF(AND(P881>=1,type1=1),\"NB! Volum av nivåene kan ikke være større enn det totale volumet for hvert enkelt materiale!\",+IF(AND(P881>=1,type1=2),\"NB! Prosentandel for hvert nivå må registreres i prosent av det vurderte bygningselementet, og den totale prosentandelen kan ikke være større enn den totale prosent av hvert enkelt materiale!\",\"\"))","v":""},null,null,null,null,null,null,null,null,null,null,null,null,1,{"$f":"1","v":1}]
[null,null,{"$f":"IF(G870=\"\",\"\",IF(SUM(G872:G879)=0,\"\",IF(U870=1,IF(U870+L880=1,\"REGISTRER DET TOTALE VOLUMET AV RELEVANTE MATERIALER\",IF((U870+G880+L880)=1,\"REGISTRER DET TOTALE VOLUMET AV RELEVANTE MATERIALER\",IF(ISERROR(C881),\"REGISTRER DET TOTALE VOLUMET AV RELEVANTE MATERIALER\",IF(OR(G872>L880,G873>L880,G874>L880,G875>L880,G876>L880,G877>L880,G878>L880,G879>L880),\"Volumet av de enkelte materialer kan ikke overstige mengden relevante materialer\",IF(SUM(G872:G879)>L880,\"Den totale mengden av materialer kan ikke overstige det  totale volumet av relevante materialer\",\"\"))))),IF(U870=2,IF(SUM(G872:G879)<80,\"Minst 80 % av de relevante materialer må vurderes, vennligst beregn på nytt.\",IF(OR(G872>100,G873>100,G874>100,G875>100,G876>100,G877>100,G878>100,G879>100),\"Prosentandel av de enkelte materialerer kan ikke overstige 100\",IF(SUM(G872:G879)>100,\"Den totale prosentandelen av materialer kan ikke overstige 100\",\"\")))))))","v":""},null,"Mat. 1",null,null,null,null,null,null,null,{"$f":"IF(SUM(H888+I888+J888+K888+L888)>=3,\"3,00\",SUM(H888+I888+J888+K888+L888))","v":0},{"$f":"IF(AND(U870=1,L880=\"\"),0,IF(OR(NOT(D871=\"\"),NOT(C872=\"\"),NOT(N873=\"\")),0,IF(ISERROR(N881),\"0\",N881)))","v":0},null,{"$f":"IF(SUM(H872:L872)>G872,\"1\",\"0\")","v":"0"},1,{"$f":"1","v":1}]
[null,null,null,null,"Mat. 2",null,null,null,null,null,null,null,null,{"$f":"IF(AND(U870=1,L880=\"\"),C872,+IF(G881>L880,C872,(IF(N881<80,\"Ingen poeng oppnådd,\nmindre enn 80 % oppfyller kravet\",\"\"))))","v":""},null,{"$f":"IF(SUM(H873:L873)>G873,\"1\",\"0\")","v":"0"},1,{"$f":"1","v":1}]
[null,null,null,null,"Mat. 3",null,null,null,null,null,null,null,null,null,null,"0",1,{"$f":"1","v":1}]
[null,null,null,null,"Mat. 4",null,null,null,null,null,null,null,null,null,null,"0",1,{"$f":"1","v":1}]
[null,null,null,null,"Mat. 5",null,null,null,null,null,null,null,null,null,null,"0",1,{"$f":"1","v":1}]
[null,null,null,null,"Mat. 6",null,null,null,null,null,null,null,null,null,null,"0",1,{"$f":"1","v":1}]
[null,null,null,null,"Mat. 7",null,null,null,null,null,null,null,null,null,null,"0",1,{"$f":"1","v":1}]
[null,null,null,null,"Mat. 8",null,null,null,null,null,null,null,null,null,null,"0",1,{"$f":"1","v":1}]
[null,null,null,null,"Totalt % av bygningselementet (relevante materialer) vurdert:",null,{"$f":"IF(U870=\"\",0,IF(U870+L880=1,0,IF(SUM(G872:G879)=0,0,IF(U870=1,IF(OR(G872>L880,G873>L880,G874>L880,G875>L880,G876>L880,G877>L880,G878>L880,G879>L880,SUM(G872:G879)>L880),0,((SUM(G872:G879)/L880)*100)),IF(U870=2,IF(OR(G872>100,G873>100,G874>100,G875>100,G876>100,G877>100,G878>100,G879>100,SUM(G872:G879)>100),0,SUM(G872:G879)))))))","v":0},"Samlet volum for aktuelle elementer:",null,null,null,null,null,null,null,null,1,{"$f":"1","v":1}]
[null,null,{"$f":"IF(G880=0,\"0\",IF(U870=2,\"0\",IF(U870=1,(G880/100)*100,IF(U870=2,(G880/100)*100))))","v":"0"},{"$f":"G880","v":0},null,"Total",{"$f":"IF(SUM(G872:G879)=0,\"1\",SUM(G872:G879))","v":"1"},{"$f":"SUM(H872:H879)","v":0},{"$f":"SUM(I872:I879)","v":0},{"$f":"SUM(J872:J879)","v":0},{"$f":"SUM(K872:K879)","v":0},{"$f":"SUM(L872:L879)","v":0},null,{"$f":"SUM(H882:L882)","v":0},{"$f":"IF(G880<80,\"0,00\",IF(P881>0,\"0\",IF(G880>100,\"0,00\",IF(N872>=80,M872,IF(N872<80,0)))))","v":"0,00"},{"$f":"P872+P873+P874+P875+P876+P877+P878+P879","v":0},{"$f":"1","v":1},{"$f":"1","v":1}]
[null,null,null,null,null,null,"Percentage",{"$f":"IF(H881+G881=0,\"0\",(H881/G881)*100)","v":0},{"$f":"IF(I881+G881=0,\"0\",(I881/G881)*100)","v":0},{"$f":"IF(J881+G881=0,\"0\",(J881/G881)*100)","v":0},{"$f":"IF(K881+G881=0,\"0\",(K881/G881)*100)","v":0},{"$f":"IF(L881+G881=0,\"0\",(L881/G881)*100)","v":0},null,100,null,null,{"$f":"1","v":1},{"$f":"1","v":1}]
[null,null,null,null,null,{"$f":"IF(U870=1,((G881/100)*80))","v":false},"% of 80",{"$f":"(H882/80)*100","v":0},{"$f":"(I882/80)*100","v":0},{"$f":"(J882/80)*100","v":0},{"$f":"(K882/80)*100","v":0},{"$f":"(L882/80)*100","v":0},null,null,null,null,{"$f":"1","v":1},{"$f":"1","v":1}]
[null,null,null,null,null,null,"Limiter",{"$f":"IF(H883>100,\"100\",H883)","v":0},{"$f":"IF(I883>100,\"100\",I883)","v":0},{"$f":"IF(J883>100,\"100\",J883)","v":0},{"$f":"IF(K883>100,\"100\",K883)","v":0},{"$f":"IF(L883>100,\"100\",L883)","v":0},null,null,null,null,{"$f":"1","v":1},{"$f":"1","v":1}]
[null,null,null,null,null,null,null,null,{"$f":"IF(H884+I884+J884+K884+L884=0,0,100-(H884))","v":0},{"$f":"IF(H884+I884+J884+K884+L884=0,0,100-(H884+I884))","v":0},{"$f":"IF(J884+I884+H884+K884+L884=0,0,100-(J884+I884+H884))","v":0},{"$f":"IF(K884+J884+I884+H884+L884=0,0,100-(H884+I884+K884+J884))","v":0},null,null,null,null,{"$f":"1","v":1},{"$f":"1","v":1}]
[null,null,null,null,null,null,null,null,{"$f":"IF(I884>I885,I885,I884)","v":0},{"$f":"IF(J884>J885,J885,J884)","v":0},{"$f":"IF(K884>K885,K885,K884)","v":0},{"$f":"IF(L884>L885,L885,L884)","v":0},null,null,null,null,{"$f":"1","v":1},{"$f":"1","v":1}]
[null,null,null,null,null,null,null,null,null,null,null,{"$f":"IF(K886+J884+H884+I884>=100,0,L886)","v":0},null,null,null,null,{"$f":"1","v":1},{"$f":"1","v":1}]
[null,null,null,null,null,null,"Scores",{"$f":"IF(H881=0,0,0.01*(H884*H889))","v":0},{"$f":"IF(I881=0,0,0.01*(I886*I889))","v":0},{"$f":"IF(J881=0,0,0.01*(J886*J889))","v":0},{"$f":"IF(K881=0,0,0.01*(K886*K889))","v":0},{"$f":"IF(L881=0,0,0.01*(L887*L889))","v":0},null,null,null,null,{"$f":"1","v":1},{"$f":"1","v":1}]
[null,null,null,null,null,null,null,3,2.5,2,1.5,1,"Total",null,null,null,{"$f":"1","v":1},{"$f":"1","v":1}]
[null,null,"GULVLISTER (4)",null,null,"Velg datatype:",null,null,null,null,null,null,null,null,null,null,{"$f":"IF(freq11>=6,0,1)","v":1},{"$f":"1","v":1},null,null,{"$f":"IF(G890=\"\",2,IF(ISERROR(VLOOKUP(G890,$T$1246:$U$1247,2,FALSE)),\"\",VLOOKUP(G890,$T$1246:$U$1247,2,FALSE)))","v":2}]
[null,null,null,{"$f":"IF(AND(P901>=1,type1=1),\"NB! Volum av nivåene kan ikke være større enn det totale volumet for hvert enkelt materiale!\",+IF(AND(P901>=1,type1=2),\"NB! Prosentandel for hvert nivå må registreres i prosent av det vurderte bygningselementet, og den totale prosentandelen kan ikke være større enn den totale prosent av hvert enkelt materiale!\",\"\"))","v":""},null,null,null,null,null,null,null,null,null,null,null,null,1,{"$f":"1","v":1}]
[null,null,{"$f":"IF(G890=\"\",\"\",IF(SUM(G892:G899)=0,\"\",IF(U890=1,IF(U890+L900=1,\"REGISTRER DET TOTALE VOLUMET AV RELEVANTE MATERIALER\",IF((U890+G900+L900)=1,\"REGISTRER DET TOTALE VOLUMET AV RELEVANTE MATERIALER\",IF(ISERROR(C901),\"REGISTRER DET TOTALE VOLUMET AV RELEVANTE MATERIALER\",IF(OR(G892>L900,G893>L900,G894>L900,G895>L900,G896>L900,G897>L900,G898>L900,G899>L900),\"Volumet av de enkelte materialer kan ikke overstige mengden relevante materialer\",IF(SUM(G892:G899)>L900,\"Den totale mengden av materialer kan ikke overstige det  totale volumet av relevante materialer\",\"\"))))),IF(U890=2,IF(SUM(G892:G899)<80,\"Minst 80 % av de relevante materialer må vurderes, vennligst beregn på nytt.\",IF(OR(G892>100,G893>100,G894>100,G895>100,G896>100,G897>100,G898>100,G899>100),\"Prosentandel av de enkelte materialerer kan ikke overstige 100\",IF(SUM(G892:G899)>100,\"Den totale prosentandelen av materialer kan ikke overstige 100\",\"\")))))))","v":""},null,"Mat. 1",null,null,null,null,null,null,null,{"$f":"IF(SUM(H908+I908+J908+K908+L908)>=3,\"3,00\",SUM(H908+I908+J908+K908+L908))","v":0},{"$f":"IF(AND(U890=1,L900=\"\"),0,IF(OR(NOT(D891=\"\"),NOT(C892=\"\"),NOT(N893=\"\")),0,IF(ISERROR(N901),\"0\",N901)))","v":0},null,{"$f":"IF(SUM(H892:L892)>G892,\"1\",\"0\")","v":"0"},1,{"$f":"1","v":1}]
[null,null,null,null,"Mat. 2",null,null,null,null,null,null,null,null,{"$f":"IF(AND(U890=1,L900=\"\"),C892,+IF(G901>L900,C892,(IF(N901<80,\"Ingen poeng oppnådd,\nmindre enn 80 % oppfyller kravet\",\"\"))))","v":""},null,{"$f":"IF(SUM(H893:L893)>G893,\"1\",\"0\")","v":"0"},1,{"$f":"1","v":1}]
[null,null,null,null,"Mat. 3",null,null,null,null,null,null,null,null,null,null,"0",1,{"$f":"1","v":1}]
[null,null,null,null,"Mat. 4",null,null,null,null,null,null,null,null,null,null,"0",1,{"$f":"1","v":1}]
[null,null,null,null,"Mat. 5",null,null,null,null,null,null,null,null,null,null,"0",1,{"$f":"1","v":1}]
[null,null,null,null,"Mat. 6",null,null,null,null,null,null,null,null,null,null,"0",1,{"$f":"1","v":1}]
[null,null,null,null,"Mat. 7",null,null,null,null,null,null,null,null,null,null,"0",1,{"$f":"1","v":1}]
[null,null,null,null,"Mat. 8",null,null,null,null,null,null,null,null,null,null,"0",1,{"$f":"1","v":1}]
[null,null,null,null,"Totalt % av bygningselementet (relevante materialer) vurdert:",null,{"$f":"IF(U890=\"\",0,IF(U890+L900=1,0,IF(SUM(G892:G899)=0,0,IF(U890=1,IF(OR(G892>L900,G893>L900,G894>L900,G895>L900,G896>L900,G897>L900,G898>L900,G899>L900,SUM(G892:G899)>L900),0,((SUM(G892:G899)/L900)*100)),IF(U890=2,IF(OR(G892>100,G893>100,G894>100,G895>100,G896>100,G897>100,G898>100,G899>100,SUM(G892:G899)>100),0,SUM(G892:G899)))))))","v":0},"Samlet volum for aktuelle elementer:",null,null,null,null,null,null,null,null,1,{"$f":"1","v":1}]
[null,null,{"$f":"IF(G900=0,\"0\",IF(U890=2,\"0\",IF(U890=1,(G900/100)*100,IF(U890=2,(G900/100)*100))))","v":"0"},{"$f":"G900","v":0},null,"Total",{"$f":"IF(SUM(G892:G899)=0,\"1\",SUM(G892:G899))","v":"1"},{"$f":"SUM(H892:H899)","v":0},{"$f":"SUM(I892:I899)","v":0},{"$f":"SUM(J892:J899)","v":0},{"$f":"SUM(K892:K899)","v":0},{"$f":"SUM(L892:L899)","v":0},null,{"$f":"SUM(H902:L902)","v":0},{"$f":"IF(G900<80,\"0,00\",IF(P901>0,\"0\",IF(G900>100,\"0,00\",IF(N892>=80,M892,IF(N892<80,0)))))","v":"0,00"},{"$f":"P892+P893+P894+P895+P896+P897+P898+P899","v":0},{"$f":"1","v":1},{"$f":"1","v":1}]
[null,null,null,null,null,null,"Percentage",{"$f":"IF(H901+G901=0,\"0\",(H901/G901)*100)","v":0},{"$f":"IF(I901+G901=0,\"0\",(I901/G901)*100)","v":0},{"$f":"IF(J901+G901=0,\"0\",(J901/G901)*100)","v":0},{"$f":"IF(K901+G901=0,\"0\",(K901/G901)*100)","v":0},{"$f":"IF(L901+G901=0,\"0\",(L901/G901)*100)","v":0},null,100,null,null,{"$f":"1","v":1},{"$f":"1","v":1}]
[null,null,null,null,null,{"$f":"IF(U890=1,((G901/100)*80))","v":false},"% of 80",{"$f":"(H902/80)*100","v":0},{"$f":"(I902/80)*100","v":0},{"$f":"(J902/80)*100","v":0},{"$f":"(K902/80)*100","v":0},{"$f":"(L902/80)*100","v":0},null,null,null,null,{"$f":"1","v":1},{"$f":"1","v":1}]
[null,null,null,null,null,null,"Limiter",{"$f":"IF(H903>100,\"100\",H903)","v":0},{"$f":"IF(I903>100,\"100\",I903)","v":0},{"$f":"IF(J903>100,\"100\",J903)","v":0},{"$f":"IF(K903>100,\"100\",K903)","v":0},{"$f":"IF(L903>100,\"100\",L903)","v":0},null,null,null,null,{"$f":"1","v":1},{"$f":"1","v":1}]
[null,null,null,null,null,null,null,null,{"$f":"IF(H904+I904+J904+K904+L904=0,0,100-(H904))","v":0},{"$f":"IF(H904+I904+J904+K904+L904=0,0,100-(H904+I904))","v":0},{"$f":"IF(J904+I904+H904+K904+L904=0,0,100-(J904+I904+H904))","v":0},{"$f":"IF(K904+J904+I904+H904+L904=0,0,100-(H904+I904+K904+J904))","v":0},null,null,null,null,{"$f":"1","v":1},{"$f":"1","v":1}]
[null,null,null,null,null,null,null,null,{"$f":"IF(I904>I905,I905,I904)","v":0},{"$f":"IF(J904>J905,J905,J904)","v":0},{"$f":"IF(K904>K905,K905,K904)","v":0},{"$f":"IF(L904>L905,L905,L904)","v":0},null,null,null,null,{"$f":"1","v":1},{"$f":"1","v":1}]
[null,null,null,null,null,null,null,null,null,null,null,{"$f":"IF(K906+J904+H904+I904>=100,0,L906)","v":0},null,null,null,null,{"$f":"1","v":1},{"$f":"1","v":1}]
[null,null,null,null,null,null,"Scores",{"$f":"IF(H901=0,0,0.01*(H904*H909))","v":0},{"$f":"IF(I901=0,0,0.01*(I906*I909))","v":0},{"$f":"IF(J901=0,0,0.01*(J906*J909))","v":0},{"$f":"IF(K901=0,0,0.01*(K906*K909))","v":0},{"$f":"IF(L901=0,0,0.01*(L907*L909))","v":0},null,null,null,null,{"$f":"1","v":1},{"$f":"1","v":1}]
[null,null,null,null,null,null,null,3,2.5,2,1.5,1,"Total",null,null,null,{"$f":"1","v":1},{"$f":"1","v":1}]
[null,null,"PANEL",null,null,"Velg antall paneler du ønsker å vurdere (deretter trykk «velg»):",null,null,null,null,{"$f":"IF(AND(G910=\"\",G921>0),\"NB! Husk å velge antall elementer...\",\"\")","v":""},null,null,null,{"$f":"IF(ISERROR(O922+O942+O962+O982)/V911,\"\",(O922+O942+O962+O982)/V911)","v":0},null,{"$f":"0","v":0},{"$f":"IF(asstype=3,0,IF(typescheme=2,0,1))","v":1},null,{"$f":"VLOOKUP(G910,$T$1239:$U$1243,2,FALSE)","v":2}]
[null,null,{"$f":"IF(G910=\"\",\"PANEL\",\"PANEL (1)\")","v":"PANEL"},null,null,"Velg datatype:",null,null,null,null,null,null,null,null,null,null,{"$f":"IF(freq12>=3,0,1)","v":1},1,null,null,{"$f":"IF(G911=\"\",2,IF(ISERROR(VLOOKUP(G911,$T$1246:$U$1247,2,FALSE)),\"\",VLOOKUP(G911,$T$1246:$U$1247,2,FALSE)))","v":2},{"$f":"IF(freq12=3,1,IF(freq12=4,2,IF(freq12=5,3,IF(freq12=6,4,1))))","v":1}]
[null,null,null,{"$f":"IF(AND(P922>=1,type1=1),\"NB! Volum av nivåene kan ikke være større enn det totale volumet for hvert enkelt materiale!\",+IF(AND(P922>=1,type1=2),\"NB! Prosentandel for hvert nivå må registreres i prosent av det vurderte bygningselementet, og den totale prosentandelen kan ikke være større enn den totale prosent av hvert enkelt materiale!\",\"\"))","v":""},null,null,null,null,null,null,null,null,null,null,null,null,1,1]
[null,null,{"$f":"IF(G911=\"\",\"\",IF(SUM(G913:G920)=0,\"\",IF(U911=1,IF(U911+L921=1,\"REGISTRER DET TOTALE VOLUMET AV RELEVANTE MATERIALER\",IF((U911+G921+L921)=1,\"REGISTRER DET TOTALE VOLUMET AV RELEVANTE MATERIALER\",IF(ISERROR(C922),\"REGISTRER DET TOTALE VOLUMET AV RELEVANTE MATERIALER\",IF(OR(G913>L921,G914>L921,G915>L921,G916>L921,G917>L921,G918>L921,G919>L921,G920>L921),\"Volumet av de enkelte materialer kan ikke overstige mengden relevante materialer\",IF(SUM(G913:G920)>L921,\"Den totale mengden av materialer kan ikke overstige det  totale volumet av relevante materialer\",\"\"))))),IF(U911=2,IF(SUM(G913:G920)<80,\"Minst 80 % av de relevante materialer må vurderes, vennligst beregn på nytt.\",IF(OR(G913>100,G914>100,G915>100,G916>100,G917>100,G918>100,G919>100,G920>100),\"Prosentandel av de enkelte materialerer kan ikke overstige 100\",IF(SUM(G913:G920)>100,\"Den totale prosentandelen av materialer kan ikke overstige 100\",\"\")))))))","v":""},null,"Mat. 1",null,null,null,null,null,null,null,{"$f":"IF(SUM(H929+I929+J929+K929+L929)>=3,\"3,00\",SUM(H929+I929+J929+K929+L929))","v":0},{"$f":"IF(AND(U911=1,L921=\"\"),0,IF(OR(NOT(D912=\"\"),NOT(C913=\"\"),NOT(N914=\"\")),0,IF(ISERROR(N922),\"0\",N922)))","v":0},null,{"$f":"IF(SUM(H913:L913)>G913,\"1\",\"0\")","v":"0"},1,1]
[null,null,null,null,"Mat. 2",null,null,null,null,null,null,null,null,{"$f":"IF(AND(U911=1,L921=\"\"),C913,+IF(G922>L921,C913,(IF(N922<80,\"Ingen poeng oppnådd,\nmindre enn 80 % oppfyller kravet\",\"\"))))","v":""},null,{"$f":"IF(SUM(H914:L914)>G914,\"1\",\"0\")","v":"0"},1,1]
[null,null,null,null,"Mat. 3",null,null,null,null,null,null,null,null,null,null,"0",1,1]
[null,null,null,null,"Mat. 4",null,null,null,null,null,null,null,null,null,null,"0",1,1]
[null,null,null,null,"Mat. 5",null,null,null,null,null,null,null,null,null,null,"0",1,1]
[null,null,null,null,"Mat. 6",null,null,null,null,null,null,null,null,null,null,"0",1,1]
[null,null,null,null,"Mat. 7",null,null,null,null,null,null,null,null,null,null,"0",1,1]
[null,null,null,null,"Mat. 8",null,null,null,null,null,null,null,null,null,null,"0",1,1]
[null,null,null,null,"Totalt % av bygningselementet (relevante materialer) vurdert:",null,{"$f":"IF(U911=\"\",0,IF(U911+L921=1,0,IF(SUM(G913:G920)=0,0,IF(U911=1,IF(OR(G913>L921,G914>L921,G915>L921,G916>L921,G917>L921,G918>L921,G919>L921,G920>L921,SUM(G913:G920)>L921),0,((SUM(G913:G920)/L921)*100)),IF(U911=2,IF(OR(G913>100,G914>100,G915>100,G916>100,G917>100,G918>100,G919>100,G920>100,SUM(G913:G920)>100),0,SUM(G913:G920)))))))","v":0},"Samlet volum for aktuelle elementer:",null,null,null,null,null,null,null,null,1,1]
[null,null,{"$f":"IF(G921=0,\"0\",IF(U914=2,\"0\",IF(U914=1,(G921/100)*100,IF(U914=2,(G921/100)*100))))","v":"0"},{"$f":"G921","v":0},null,"Total",{"$f":"IF(SUM(G913:G920)=0,\"1\",SUM(G913:G920))","v":"1"},{"$f":"SUM(H913:H920)","v":0},{"$f":"SUM(I913:I920)","v":0},{"$f":"SUM(J913:J920)","v":0},{"$f":"SUM(K913:K920)","v":0},{"$f":"SUM(L913:L920)","v":0},null,{"$f":"SUM(H923:L923)","v":0},{"$f":"IF(G921<80,\"0,00\",IF(P922>0,\"0\",IF(G921>100,\"0,00\",IF(N913>=80,M913,IF(N913<80,0)))))","v":"0,00"},{"$f":"P913+P914+P915+P916+P917+P918+P919+P920","v":0},{"$f":"1","v":1},{"$f":"1","v":1}]
[null,null,null,null,null,null,"Percentage",{"$f":"IF(H922+G922=0,\"0\",(H922/G922)*100)","v":0},{"$f":"IF(I922+G922=0,\"0\",(I922/G922)*100)","v":0},{"$f":"IF(J922+G922=0,\"0\",(J922/G922)*100)","v":0},{"$f":"IF(K922+G922=0,\"0\",(K922/G922)*100)","v":0},{"$f":"IF(L922+G922=0,\"0\",(L922/G922)*100)","v":0},null,100,null,null,{"$f":"1","v":1},{"$f":"1","v":1}]
[null,null,null,null,null,{"$f":"IF(U914=1,((G922/100)*80))","v":false},"% of 80",{"$f":"(H923/80)*100","v":0},{"$f":"(I923/80)*100","v":0},{"$f":"(J923/80)*100","v":0},{"$f":"(K923/80)*100","v":0},{"$f":"(L923/80)*100","v":0},null,null,null,null,{"$f":"1","v":1},{"$f":"1","v":1}]
[null,null,null,null,null,null,"Limiter",{"$f":"IF(H924>100,\"100\",H924)","v":0},{"$f":"IF(I924>100,\"100\",I924)","v":0},{"$f":"IF(J924>100,\"100\",J924)","v":0},{"$f":"IF(K924>100,\"100\",K924)","v":0},{"$f":"IF(L924>100,\"100\",L924)","v":0},null,null,null,null,{"$f":"1","v":1},{"$f":"1","v":1}]
[null,null,null,null,null,null,null,null,{"$f":"IF(H925+I925+J925+K925+L925=0,0,100-(H925))","v":0},{"$f":"IF(H925+I925+J925+K925+L925=0,0,100-(H925+I925))","v":0},{"$f":"IF(J925+I925+H925+K925+L925=0,0,100-(J925+I925+H925))","v":0},{"$f":"IF(K925+J925+I925+H925+L925=0,0,100-(H925+I925+K925+J925))","v":0},null,null,null,null,{"$f":"1","v":1},{"$f":"1","v":1}]
[null,null,null,null,null,null,null,null,{"$f":"IF(I925>I926,I926,I925)","v":0},{"$f":"IF(J925>J926,J926,J925)","v":0},{"$f":"IF(K925>K926,K926,K925)","v":0},{"$f":"IF(L925>L926,L926,L925)","v":0},null,null,null,null,{"$f":"1","v":1},{"$f":"1","v":1}]
[null,null,null,null,null,null,null,null,null,null,null,{"$f":"IF(K927+J925+H925+I925>=100,0,L927)","v":0},null,null,null,null,{"$f":"1","v":1},{"$f":"1","v":1}]
[null,null,null,null,null,null,"Scores",{"$f":"IF(H922=0,0,0.01*(H925*H930))","v":0},{"$f":"IF(I922=0,0,0.01*(I927*I930))","v":0},{"$f":"IF(J922=0,0,0.01*(J927*J930))","v":0},{"$f":"IF(K922=0,0,0.01*(K927*K930))","v":0},{"$f":"IF(L922=0,0,0.01*(L928*L930))","v":0},null,null,null,null,{"$f":"1","v":1},{"$f":"1","v":1}]
[null,null,null,null,null,null,null,3,2.5,2,1.5,1,"Total",null,null,null,{"$f":"1","v":1},{"$f":"1","v":1}]
[null,null,"PANEL (2)",null,null,"Velg datatype:",null,null,null,null,null,null,null,null,null,null,{"$f":"IF(freq12>=4,0,1)","v":1},{"$f":"1","v":1},null,null,{"$f":"IF(G931=\"\",2,IF(ISERROR(VLOOKUP(G931,$T$1246:$U$1247,2,FALSE)),\"\",VLOOKUP(G931,$T$1246:$U$1247,2,FALSE)))","v":2}]
[null,null,null,{"$f":"IF(AND(P942>=1,type1=1),\"NB! Volum av nivåene kan ikke være større enn det totale volumet for hvert enkelt materiale!\",+IF(AND(P942>=1,type1=2),\"NB! Prosentandel for hvert nivå må registreres i prosent av det vurderte bygningselementet, og den totale prosentandelen kan ikke være større enn den totale prosent av hvert enkelt materiale!\",\"\"))","v":""},null,null,null,null,null,null,null,null,null,null,null,null,1,{"$f":"1","v":1}]
[null,null,{"$f":"IF(G931=\"\",\"\",IF(SUM(G933:G940)=0,\"\",IF(U931=1,IF(U931+L941=1,\"REGISTRER DET TOTALE VOLUMET AV RELEVANTE MATERIALER\",IF((U931+G941+L941)=1,\"REGISTRER DET TOTALE VOLUMET AV RELEVANTE MATERIALER\",IF(ISERROR(C942),\"REGISTRER DET TOTALE VOLUMET AV RELEVANTE MATERIALER\",IF(OR(G933>L941,G934>L941,G935>L941,G936>L941,G937>L941,G938>L941,G939>L941,G940>L941),\"Volumet av de enkelte materialer kan ikke overstige mengden relevante materialer\",IF(SUM(G933:G940)>L941,\"Den totale mengden av materialer kan ikke overstige det  totale volumet av relevante materialer\",\"\"))))),IF(U931=2,IF(SUM(G933:G940)<80,\"Minst 80 % av de relevante materialer må vurderes, vennligst beregn på nytt.\",IF(OR(G933>100,G934>100,G935>100,G936>100,G937>100,G938>100,G939>100,G940>100),\"Prosentandel av de enkelte materialerer kan ikke overstige 100\",IF(SUM(G933:G940)>100,\"Den totale prosentandelen av materialer kan ikke overstige 100\",\"\")))))))","v":""},null,"Mat. 1",null,null,null,null,null,null,null,{"$f":"IF(SUM(H949+I949+J949+K949+L949)>=3,\"3,00\",SUM(H949+I949+J949+K949+L949))","v":0},{"$f":"IF(AND(U931=1,L941=\"\"),0,IF(OR(NOT(D932=\"\"),NOT(C933=\"\"),NOT(N934=\"\")),0,IF(ISERROR(N942),\"0\",N942)))","v":0},null,{"$f":"IF(SUM(H933:L933)>G933,\"1\",\"0\")","v":"0"},1,{"$f":"1","v":1}]
[null,null,null,null,"Mat. 2",null,null,null,null,null,null,null,null,{"$f":"IF(AND(U931=1,L941=\"\"),C933,+IF(G942>L941,C933,(IF(N942<80,\"Ingen poeng oppnådd,\nmindre enn 80 % oppfyller kravet\",\"\"))))","v":""},null,{"$f":"IF(SUM(H934:L934)>G934,\"1\",\"0\")","v":"0"},1,{"$f":"1","v":1}]
[null,null,null,null,"Mat. 3",null,null,null,null,null,null,null,null,null,null,"0",1,{"$f":"1","v":1}]
[null,null,null,null,"Mat. 4",null,null,null,null,null,null,null,null,null,null,"0",1,{"$f":"1","v":1}]
[null,null,null,null,"Mat. 5",null,null,null,null,null,null,null,null,null,null,"0",1,{"$f":"1","v":1}]
[null,null,null,null,"Mat. 6",null,null,null,null,null,null,null,null,null,null,"0",1,{"$f":"1","v":1}]
[null,null,null,null,"Mat. 7",null,null,null,null,null,null,null,null,null,null,"0",1,{"$f":"1","v":1}]
[null,null,null,null,"Mat. 8",null,null,null,null,null,null,null,null,null,null,"0",1,{"$f":"1","v":1}]
[null,null,null,null,"Totalt % av bygningselementet (relevante materialer) vurdert:",null,{"$f":"IF(U931=\"\",0,IF(U931+L941=1,0,IF(SUM(G933:G940)=0,0,IF(U931=1,IF(OR(G933>L941,G934>L941,G935>L941,G936>L941,G937>L941,G938>L941,G939>L941,G940>L941,SUM(G933:G940)>L941),0,((SUM(G933:G940)/L941)*100)),IF(U931=2,IF(OR(G933>100,G934>100,G935>100,G936>100,G937>100,G938>100,G939>100,G940>100,SUM(G933:G940)>100),0,SUM(G933:G940)))))))","v":0},"Samlet volum for aktuelle elementer:",null,null,null,null,null,null,null,null,1,{"$f":"1","v":1}]
[null,null,{"$f":"IF(G941=0,\"0\",IF(U931=2,\"0\",IF(U931=1,(G941/100)*100,IF(U931=2,(G941/100)*100))))","v":"0"},{"$f":"G941","v":0},null,"Total",{"$f":"IF(SUM(G933:G940)=0,\"1\",SUM(G933:G940))","v":"1"},{"$f":"SUM(H933:H940)","v":0},{"$f":"SUM(I933:I940)","v":0},{"$f":"SUM(J933:J940)","v":0},{"$f":"SUM(K933:K940)","v":0},{"$f":"SUM(L933:L940)","v":0},null,{"$f":"SUM(H943:L943)","v":0},{"$f":"IF(G941<80,\"0,00\",IF(P942>0,\"0\",IF(G941>100,\"0,00\",IF(N933>=80,M933,IF(N933<80,0)))))","v":"0,00"},{"$f":"P933+P934+P935+P936+P937+P938+P939+P940","v":0},{"$f":"1","v":1},{"$f":"1","v":1}]
[null,null,null,null,null,null,"Percentage",{"$f":"IF(H942+G942=0,\"0\",(H942/G942)*100)","v":0},{"$f":"IF(I942+G942=0,\"0\",(I942/G942)*100)","v":0},{"$f":"IF(J942+G942=0,\"0\",(J942/G942)*100)","v":0},{"$f":"IF(K942+G942=0,\"0\",(K942/G942)*100)","v":0},{"$f":"IF(L942+G942=0,\"0\",(L942/G942)*100)","v":0},null,100,null,null,{"$f":"1","v":1},{"$f":"1","v":1}]
[null,null,null,null,null,{"$f":"IF(U931=1,((G942/100)*80))","v":false},"% of 80",{"$f":"(H943/80)*100","v":0},{"$f":"(I943/80)*100","v":0},{"$f":"(J943/80)*100","v":0},{"$f":"(K943/80)*100","v":0},{"$f":"(L943/80)*100","v":0},null,null,null,null,{"$f":"1","v":1},{"$f":"1","v":1}]
[null,null,null,null,null,null,"Limiter",{"$f":"IF(H944>100,\"100\",H944)","v":0},{"$f":"IF(I944>100,\"100\",I944)","v":0},{"$f":"IF(J944>100,\"100\",J944)","v":0},{"$f":"IF(K944>100,\"100\",K944)","v":0},{"$f":"IF(L944>100,\"100\",L944)","v":0},null,null,null,null,{"$f":"1","v":1},{"$f":"1","v":1}]
[null,null,null,null,null,null,null,null,{"$f":"IF(H945+I945+J945+K945+L945=0,0,100-(H945))","v":0},{"$f":"IF(H945+I945+J945+K945+L945=0,0,100-(H945+I945))","v":0},{"$f":"IF(J945+I945+H945+K945+L945=0,0,100-(J945+I945+H945))","v":0},{"$f":"IF(K945+J945+I945+H945+L945=0,0,100-(H945+I945+K945+J945))","v":0},null,null,null,null,{"$f":"1","v":1},{"$f":"1","v":1}]
[null,null,null,null,null,null,null,null,{"$f":"IF(I945>I946,I946,I945)","v":0},{"$f":"IF(J945>J946,J946,J945)","v":0},{"$f":"IF(K945>K946,K946,K945)","v":0},{"$f":"IF(L945>L946,L946,L945)","v":0},null,null,null,null,{"$f":"1","v":1},{"$f":"1","v":1}]
[null,null,null,null,null,null,null,null,null,null,null,{"$f":"IF(K947+J945+H945+I945>=100,0,L947)","v":0},null,null,null,null,{"$f":"1","v":1},{"$f":"1","v":1}]
[null,null,null,null,null,null,"Scores",{"$f":"IF(H942=0,0,0.01*(H945*H950))","v":0},{"$f":"IF(I942=0,0,0.01*(I947*I950))","v":0},{"$f":"IF(J942=0,0,0.01*(J947*J950))","v":0},{"$f":"IF(K942=0,0,0.01*(K947*K950))","v":0},{"$f":"IF(L942=0,0,0.01*(L948*L950))","v":0},null,null,null,null,{"$f":"1","v":1},{"$f":"1","v":1}]
[null,null,null,null,null,null,null,3,2.5,2,1.5,1,"Total",null,null,null,{"$f":"1","v":1},{"$f":"1","v":1}]
[null,null,"PANEL (3)",null,null,"Velg datatype:",null,null,null,null,null,null,null,null,null,null,{"$f":"IF(freq12>=5,0,1)","v":1},{"$f":"1","v":1},null,null,{"$f":"IF(G951=\"\",2,IF(ISERROR(VLOOKUP(G951,$T$1246:$U$1247,2,FALSE)),\"\",VLOOKUP(G951,$T$1246:$U$1247,2,FALSE)))","v":2}]
[null,null,null,{"$f":"IF(AND(P962>=1,type1=1),\"NB! Volum av nivåene kan ikke være større enn det totale volumet for hvert enkelt materiale!\",+IF(AND(P962>=1,type1=2),\"NB! Prosentandel for hvert nivå må registreres i prosent av det vurderte bygningselementet, og den totale prosentandelen kan ikke være større enn den totale prosent av hvert enkelt materiale!\",\"\"))","v":""},null,null,null,null,null,null,null,null,null,null,null,null,1,{"$f":"1","v":1}]
[null,null,{"$f":"IF(G951=\"\",\"\",IF(SUM(G953:G960)=0,\"\",IF(U951=1,IF(U951+L961=1,\"REGISTRER DET TOTALE VOLUMET AV RELEVANTE MATERIALER\",IF((U951+G961+L961)=1,\"REGISTRER DET TOTALE VOLUMET AV RELEVANTE MATERIALER\",IF(ISERROR(C962),\"REGISTRER DET TOTALE VOLUMET AV RELEVANTE MATERIALER\",IF(OR(G953>L961,G954>L961,G955>L961,G956>L961,G957>L961,G958>L961,G959>L961,G960>L961),\"Volumet av de enkelte materialer kan ikke overstige mengden relevante materialer\",IF(SUM(G953:G960)>L961,\"Den totale mengden av materialer kan ikke overstige det  totale volumet av relevante materialer\",\"\"))))),IF(U951=2,IF(SUM(G953:G960)<80,\"Minst 80 % av de relevante materialer må vurderes, vennligst beregn på nytt.\",IF(OR(G953>100,G954>100,G955>100,G956>100,G957>100,G958>100,G959>100,G960>100),\"Prosentandel av de enkelte materialerer kan ikke overstige 100\",IF(SUM(G953:G960)>100,\"Den totale prosentandelen av materialer kan ikke overstige 100\",\"\")))))))","v":""},null,"Mat. 1",null,null,null,null,null,null,null,{"$f":"IF(SUM(H969+I969+J969+K969+L969)>=3,\"3,00\",SUM(H969+I969+J969+K969+L969))","v":0},{"$f":"IF(AND(U951=1,L961=\"\"),0,IF(OR(NOT(D952=\"\"),NOT(C953=\"\"),NOT(N954=\"\")),0,IF(ISERROR(N962),\"0\",N962)))","v":0},null,{"$f":"IF(SUM(H953:L953)>G953,\"1\",\"0\")","v":"0"},1,{"$f":"1","v":1}]
[null,null,null,null,"Mat. 2",null,null,null,null,null,null,null,null,{"$f":"IF(AND(U951=1,L961=\"\"),C953,+IF(G962>L961,C953,(IF(N962<80,\"Ingen poeng oppnådd,\nmindre enn 80 % oppfyller kravet\",\"\"))))","v":""},null,{"$f":"IF(SUM(H954:L954)>G954,\"1\",\"0\")","v":"0"},1,{"$f":"1","v":1}]
[null,null,null,null,"Mat. 3",null,null,null,null,null,null,null,null,null,null,"0",1,{"$f":"1","v":1}]
[null,null,null,null,"Mat. 4",null,null,null,null,null,null,null,null,null,null,"0",1,{"$f":"1","v":1}]
[null,null,null,null,"Mat. 5",null,null,null,null,null,null,null,null,null,null,"0",1,{"$f":"1","v":1}]
[null,null,null,null,"Mat. 6",null,null,null,null,null,null,null,null,null,null,"0",1,{"$f":"1","v":1}]
[null,null,null,null,"Mat. 7",null,null,null,null,null,null,null,null,null,null,"0",1,{"$f":"1","v":1}]
[null,null,null,null,"Mat. 8",null,null,null,null,null,null,null,null,null,null,"0",1,{"$f":"1","v":1}]
[null,null,null,null,"Totalt % av bygningselementet (relevante materialer) vurdert:",null,{"$f":"IF(U951=\"\",0,IF(U951+L961=1,0,IF(SUM(G953:G960)=0,0,IF(U951=1,IF(OR(G953>L961,G954>L961,G955>L961,G956>L961,G957>L961,G958>L961,G959>L961,G960>L961,SUM(G953:G960)>L961),0,((SUM(G953:G960)/L961)*100)),IF(U951=2,IF(OR(G953>100,G954>100,G955>100,G956>100,G957>100,G958>100,G959>100,G960>100,SUM(G953:G960)>100),0,SUM(G953:G960)))))))","v":0},"Samlet volum for aktuelle elementer:",null,null,null,null,null,null,null,null,1,{"$f":"1","v":1}]
[null,null,{"$f":"IF(G961=0,\"0\",IF(U951=2,\"0\",IF(U951=1,(G961/100)*100,IF(U951=2,(G961/100)*100))))","v":"0"},{"$f":"G961","v":0},null,"Total",{"$f":"IF(SUM(G953:G960)=0,\"1\",SUM(G953:G960))","v":"1"},{"$f":"SUM(H953:H960)","v":0},{"$f":"SUM(I953:I960)","v":0},{"$f":"SUM(J953:J960)","v":0},{"$f":"SUM(K953:K960)","v":0},{"$f":"SUM(L953:L960)","v":0},null,{"$f":"SUM(H963:L963)","v":0},{"$f":"IF(G961<80,\"0,00\",IF(P962>0,\"0\",IF(G961>100,\"0,00\",IF(N953>=80,M953,IF(N953<80,0)))))","v":"0,00"},{"$f":"P953+P954+P955+P956+P957+P958+P959+P960","v":0},{"$f":"1","v":1},{"$f":"1","v":1}]
[null,null,null,null,null,null,"Percentage",{"$f":"IF(H962+G962=0,\"0\",(H962/G962)*100)","v":0},{"$f":"IF(I962+G962=0,\"0\",(I962/G962)*100)","v":0},{"$f":"IF(J962+G962=0,\"0\",(J962/G962)*100)","v":0},{"$f":"IF(K962+G962=0,\"0\",(K962/G962)*100)","v":0},{"$f":"IF(L962+G962=0,\"0\",(L962/G962)*100)","v":0},null,100,null,null,{"$f":"1","v":1},{"$f":"1","v":1}]
[null,null,null,null,null,{"$f":"IF(U951=1,((G962/100)*80))","v":false},"% of 80",{"$f":"(H963/80)*100","v":0},{"$f":"(I963/80)*100","v":0},{"$f":"(J963/80)*100","v":0},{"$f":"(K963/80)*100","v":0},{"$f":"(L963/80)*100","v":0},null,null,null,null,{"$f":"1","v":1},{"$f":"1","v":1}]
[null,null,null,null,null,null,"Limiter",{"$f":"IF(H964>100,\"100\",H964)","v":0},{"$f":"IF(I964>100,\"100\",I964)","v":0},{"$f":"IF(J964>100,\"100\",J964)","v":0},{"$f":"IF(K964>100,\"100\",K964)","v":0},{"$f":"IF(L964>100,\"100\",L964)","v":0},null,null,null,null,{"$f":"1","v":1},{"$f":"1","v":1}]
[null,null,null,null,null,null,null,null,{"$f":"IF(H965+I965+J965+K965+L965=0,0,100-(H965))","v":0},{"$f":"IF(H965+I965+J965+K965+L965=0,0,100-(H965+I965))","v":0},{"$f":"IF(J965+I965+H965+K965+L965=0,0,100-(J965+I965+H965))","v":0},{"$f":"IF(K965+J965+I965+H965+L965=0,0,100-(H965+I965+K965+J965))","v":0},null,null,null,null,{"$f":"1","v":1},{"$f":"1","v":1}]
[null,null,null,null,null,null,null,null,{"$f":"IF(I965>I966,I966,I965)","v":0},{"$f":"IF(J965>J966,J966,J965)","v":0},{"$f":"IF(K965>K966,K966,K965)","v":0},{"$f":"IF(L965>L966,L966,L965)","v":0},null,null,null,null,{"$f":"1","v":1},{"$f":"1","v":1}]
[null,null,null,null,null,null,null,null,null,null,null,{"$f":"IF(K967+J965+H965+I965>=100,0,L967)","v":0},null,null,null,null,{"$f":"1","v":1},{"$f":"1","v":1}]
[null,null,null,null,null,null,"Scores",{"$f":"IF(H962=0,0,0.01*(H965*H970))","v":0},{"$f":"IF(I962=0,0,0.01*(I967*I970))","v":0},{"$f":"IF(J962=0,0,0.01*(J967*J970))","v":0},{"$f":"IF(K962=0,0,0.01*(K967*K970))","v":0},{"$f":"IF(L962=0,0,0.01*(L968*L970))","v":0},null,null,null,null,{"$f":"1","v":1},{"$f":"1","v":1}]
[null,null,null,null,null,null,null,3,2.5,2,1.5,1,"Total",null,null,null,{"$f":"1","v":1},{"$f":"1","v":1}]
[null,null,"PANEL (4)",null,null,"Velg datatype:",null,null,null,null,null,null,null,null,null,null,{"$f":"IF(freq12>=6,0,1)","v":1},{"$f":"1","v":1},null,null,{"$f":"IF(G971=\"\",2,IF(ISERROR(VLOOKUP(G971,$T$1246:$U$1247,2,FALSE)),\"\",VLOOKUP(G971,$T$1246:$U$1247,2,FALSE)))","v":2}]
[null,null,null,{"$f":"IF(AND(P982>=1,type1=1),\"NB! Volum av nivåene kan ikke være større enn det totale volumet for hvert enkelt materiale!\",+IF(AND(P982>=1,type1=2),\"NB! Prosentandel for hvert nivå må registreres i prosent av det vurderte bygningselementet, og den totale prosentandelen kan ikke være større enn den totale prosent av hvert enkelt materiale!\",\"\"))","v":""},null,null,null,null,null,null,null,null,null,null,null,null,1,{"$f":"1","v":1}]
[null,null,{"$f":"IF(G971=\"\",\"\",IF(SUM(G973:G980)=0,\"\",IF(U971=1,IF(U971+L981=1,\"REGISTRER DET TOTALE VOLUMET AV RELEVANTE MATERIALER\",IF((U971+G981+L981)=1,\"REGISTRER DET TOTALE VOLUMET AV RELEVANTE MATERIALER\",IF(ISERROR(C982),\"REGISTRER DET TOTALE VOLUMET AV RELEVANTE MATERIALER\",IF(OR(G973>L981,G974>L981,G975>L981,G976>L981,G977>L981,G978>L981,G979>L981,G980>L981),\"Volumet av de enkelte materialer kan ikke overstige mengden relevante materialer\",IF(SUM(G973:G980)>L981,\"Den totale mengden av materialer kan ikke overstige det  totale volumet av relevante materialer\",\"\"))))),IF(U971=2,IF(SUM(G973:G980)<80,\"Minst 80 % av de relevante materialer må vurderes, vennligst beregn på nytt.\",IF(OR(G973>100,G974>100,G975>100,G976>100,G977>100,G978>100,G979>100,G980>100),\"Prosentandel av de enkelte materialerer kan ikke overstige 100\",IF(SUM(G973:G980)>100,\"Den totale prosentandelen av materialer kan ikke overstige 100\",\"\")))))))","v":""},null,"Mat. 1",null,null,null,null,null,null,null,{"$f":"IF(SUM(H989+I989+J989+K989+L989)>=3,\"3,00\",SUM(H989+I989+J989+K989+L989))","v":0},{"$f":"IF(AND(U971=1,L981=\"\"),0,IF(OR(NOT(D972=\"\"),NOT(C973=\"\"),NOT(N974=\"\")),0,IF(ISERROR(N982),\"0\",N982)))","v":0},null,{"$f":"IF(SUM(H973:L973)>G973,\"1\",\"0\")","v":"0"},1,{"$f":"1","v":1}]
[null,null,null,null,"Mat. 2",null,null,null,null,null,null,null,null,{"$f":"IF(AND(U971=1,L981=\"\"),C973,+IF(G982>L981,C973,(IF(N982<80,\"Ingen poeng oppnådd,\nmindre enn 80 % oppfyller kravet\",\"\"))))","v":""},null,{"$f":"IF(SUM(H974:L974)>G974,\"1\",\"0\")","v":"0"},1,{"$f":"1","v":1}]
[null,null,null,null,"Mat. 3",null,null,null,null,null,null,null,null,null,null,"0",1,{"$f":"1","v":1}]
[null,null,null,null,"Mat. 4",null,null,null,null,null,null,null,null,null,null,"0",1,{"$f":"1","v":1}]
[null,null,null,null,"Mat. 5",null,null,null,null,null,null,null,null,null,null,"0",1,{"$f":"1","v":1}]
[null,null,null,null,"Mat. 6",null,null,null,null,null,null,null,null,null,null,"0",1,{"$f":"1","v":1}]
[null,null,null,null,"Mat. 7",null,null,null,null,null,null,null,null,null,null,"0",1,{"$f":"1","v":1}]
[null,null,null,null,"Mat. 8",null,null,null,null,null,null,null,null,null,null,"0",1,{"$f":"1","v":1}]
[null,null,null,null,"Totalt % av bygningselementet (relevante materialer) vurdert:",null,{"$f":"IF(U971=\"\",0,IF(U971+L981=1,0,IF(SUM(G973:G980)=0,0,IF(U971=1,IF(OR(G973>L981,G974>L981,G975>L981,G976>L981,G977>L981,G978>L981,G979>L981,G980>L981,SUM(G973:G980)>L981),0,((SUM(G973:G980)/L981)*100)),IF(U971=2,IF(OR(G973>100,G974>100,G975>100,G976>100,G977>100,G978>100,G979>100,G980>100,SUM(G973:G980)>100),0,SUM(G973:G980)))))))","v":0},"Samlet volum for aktuelle elementer:",null,null,null,null,null,null,null,null,1,{"$f":"1","v":1}]
[null,null,{"$f":"IF(G981=0,\"0\",IF(U971=2,\"0\",IF(U971=1,(G981/100)*100,IF(U971=2,(G981/100)*100))))","v":"0"},{"$f":"G981","v":0},null,"Total",{"$f":"IF(SUM(G973:G980)=0,\"1\",SUM(G973:G980))","v":"1"},{"$f":"SUM(H973:H980)","v":0},{"$f":"SUM(I973:I980)","v":0},{"$f":"SUM(J973:J980)","v":0},{"$f":"SUM(K973:K980)","v":0},{"$f":"SUM(L973:L980)","v":0},null,{"$f":"SUM(H983:L983)","v":0},{"$f":"IF(G981<80,\"0,00\",IF(P982>0,\"0\",IF(G981>100,\"0,00\",IF(N973>=80,M973,IF(N973<80,0)))))","v":"0,00"},{"$f":"P973+P974+P975+P976+P977+P978+P979+P980","v":0},{"$f":"1","v":1},{"$f":"1","v":1}]
[null,null,null,null,null,null,"Percentage",{"$f":"IF(H982+G982=0,\"0\",(H982/G982)*100)","v":0},{"$f":"IF(I982+G982=0,\"0\",(I982/G982)*100)","v":0},{"$f":"IF(J982+G982=0,\"0\",(J982/G982)*100)","v":0},{"$f":"IF(K982+G982=0,\"0\",(K982/G982)*100)","v":0},{"$f":"IF(L982+G982=0,\"0\",(L982/G982)*100)","v":0},null,100,null,null,{"$f":"1","v":1},{"$f":"1","v":1}]
[null,null,null,null,null,{"$f":"IF(U971=1,((G982/100)*80))","v":false},"% of 80",{"$f":"(H983/80)*100","v":0},{"$f":"(I983/80)*100","v":0},{"$f":"(J983/80)*100","v":0},{"$f":"(K983/80)*100","v":0},{"$f":"(L983/80)*100","v":0},null,null,null,null,{"$f":"1","v":1},{"$f":"1","v":1}]
[null,null,null,null,null,null,"Limiter",{"$f":"IF(H984>100,\"100\",H984)","v":0},{"$f":"IF(I984>100,\"100\",I984)","v":0},{"$f":"IF(J984>100,\"100\",J984)","v":0},{"$f":"IF(K984>100,\"100\",K984)","v":0},{"$f":"IF(L984>100,\"100\",L984)","v":0},null,null,null,null,{"$f":"1","v":1},{"$f":"1","v":1}]
[null,null,null,null,null,null,null,null,{"$f":"IF(H985+I985+J985+K985+L985=0,0,100-(H985))","v":0},{"$f":"IF(H985+I985+J985+K985+L985=0,0,100-(H985+I985))","v":0},{"$f":"IF(J985+I985+H985+K985+L985=0,0,100-(J985+I985+H985))","v":0},{"$f":"IF(K985+J985+I985+H985+L985=0,0,100-(H985+I985+K985+J985))","v":0},null,null,null,null,{"$f":"1","v":1},{"$f":"1","v":1}]
[null,null,null,null,null,null,null,null,{"$f":"IF(I985>I986,I986,I985)","v":0},{"$f":"IF(J985>J986,J986,J985)","v":0},{"$f":"IF(K985>K986,K986,K985)","v":0},{"$f":"IF(L985>L986,L986,L985)","v":0},null,null,null,null,{"$f":"1","v":1},{"$f":"1","v":1}]
[null,null,null,null,null,null,null,null,null,null,null,{"$f":"IF(K987+J985+H985+I985>=100,0,L987)","v":0},null,null,null,null,{"$f":"1","v":1},{"$f":"1","v":1}]
[null,null,null,null,null,null,"Scores",{"$f":"IF(H982=0,0,0.01*(H985*H990))","v":0},{"$f":"IF(I982=0,0,0.01*(I987*I990))","v":0},{"$f":"IF(J982=0,0,0.01*(J987*J990))","v":0},{"$f":"IF(K982=0,0,0.01*(K987*K990))","v":0},{"$f":"IF(L982=0,0,0.01*(L988*L990))","v":0},null,null,null,null,{"$f":"1","v":1},{"$f":"1","v":1}]
[null,null,null,null,null,null,null,3,2.5,2,1.5,1,"Total",null,null,null,{"$f":"1","v":1},{"$f":"1","v":1}]
[null,null,"INVENTAR",null,null,"Velg antall inventar du ønsker å vurdere (deretter trykk «velg»):",null,null,null,null,{"$f":"IF(AND(G991=\"\",G1002>0),\"NB! Husk å velge antall elementer...\",\"\")","v":""},null,null,null,{"$f":"IF(ISERROR(O1003+O1023+O1043+O1063)/V992,\"\",(O1003+O1023+O1043+O1063)/V992)","v":0},null,{"$f":"0","v":0},{"$f":"IF(asstype=3,0,IF(typescheme=2,0,1))","v":1},null,{"$f":"VLOOKUP(G991,$T$1239:$U$1243,2,FALSE)","v":2}]
[null,null,{"$f":"IF(G991=\"\",\"INVENTAR\",\"INVENTAR (1)\")","v":"INVENTAR"},null,null,"Velg datatype:",null,null,null,null,null,null,null,null,null,null,{"$f":"IF(freq13>=3,0,1)","v":1},1,null,null,{"$f":"IF(G992=\"\",2,IF(ISERROR(VLOOKUP(G992,$T$1246:$U$1247,2,FALSE)),\"\",VLOOKUP(G992,$T$1246:$U$1247,2,FALSE)))","v":2},{"$f":"IF(freq13=3,1,IF(freq13=4,2,IF(freq13=5,3,IF(freq13=6,4,1))))","v":1}]
[null,null,null,{"$f":"IF(AND(P1003>=1,type1=1),\"NB! Volum av nivåene kan ikke være større enn det totale volumet for hvert enkelt materiale!\",+IF(AND(P1003>=1,type1=2),\"NB! Prosentandel for hvert nivå må registreres i prosent av det vurderte bygningselementet, og den totale prosentandelen kan ikke være større enn den totale prosent av hvert enkelt materiale!\",\"\"))","v":""},null,null,null,null,null,null,null,null,null,null,null,null,1,1]
[null,null,{"$f":"IF(G992=\"\",\"\",IF(SUM(G994:G1001)=0,\"\",IF(U992=1,IF(U992+L1002=1,\"REGISTRER DET TOTALE VOLUMET AV RELEVANTE MATERIALER\",IF((U992+G1002+L1002)=1,\"REGISTRER DET TOTALE VOLUMET AV RELEVANTE MATERIALER\",IF(ISERROR(C1003),\"REGISTRER DET TOTALE VOLUMET AV RELEVANTE MATERIALER\",IF(OR(G994>L1002,G995>L1002,G996>L1002,G997>L1002,G998>L1002,G999>L1002,G1000>L1002,G1001>L1002),\"Volumet av de enkelte materialer kan ikke overstige mengden relevante materialer\",IF(SUM(G994:G1001)>L1002,\"Den totale mengden av materialer kan ikke overstige det  totale volumet av relevante materialer\",\"\"))))),IF(U992=2,IF(SUM(G994:G1001)<80,\"Minst 80 % av de relevante materialer må vurderes, vennligst beregn på nytt.\",IF(OR(G994>100,G995>100,G996>100,G997>100,G998>100,G999>100,G1000>100,G1001>100),\"Prosentandel av de enkelte materialerer kan ikke overstige 100\",IF(SUM(G994:G1001)>100,\"Den totale prosentandelen av materialer kan ikke overstige 100\",\"\")))))))","v":""},null,"Mat. 1",null,null,null,null,null,null,null,{"$f":"IF(SUM(H1010+I1010+J1010+K1010+L1010)>=3,\"3,00\",SUM(H1010+I1010+J1010+K1010+L1010))","v":0},{"$f":"IF(AND(U992=1,L1002=\"\"),0,IF(OR(NOT(D993=\"\"),NOT(C994=\"\"),NOT(N995=\"\")),0,IF(ISERROR(N1003),\"0\",N1003)))","v":0},null,{"$f":"IF(SUM(H994:L994)>G994,\"1\",\"0\")","v":"0"},1,1]
[null,null,null,null,"Mat. 2",null,null,null,null,null,null,null,null,{"$f":"IF(AND(U992=1,L1002=\"\"),C994,+IF(G1003>L1002,C994,(IF(N1003<80,\"Ingen poeng oppnådd,\nmindre enn 80 % oppfyller kravet\",\"\"))))","v":""},null,{"$f":"IF(SUM(H995:L995)>G995,\"1\",\"0\")","v":"0"},1,1]
[null,null,null,null,"Mat. 3",null,null,null,null,null,null,null,null,null,null,"0",1,1]
[null,null,null,null,"Mat. 4",null,null,null,null,null,null,null,null,null,null,"0",1,1]
[null,null,null,null,"Mat. 5",null,null,null,null,null,null,null,null,null,null,"0",1,1]
[null,null,null,null,"Mat. 6",null,null,null,null,null,null,null,null,null,null,"0",1,1]
[null,null,null,null,"Mat. 7",null,null,null,null,null,null,null,null,null,null,"0",1,1]
[null,null,null,null,"Mat. 8",null,null,null,null,null,null,null,null,null,null,"0",1,1]
[null,null,null,null,"Totalt % av bygningselementet (relevante materialer) vurdert:",null,{"$f":"IF(U992=\"\",0,IF(U992+L1002=1,0,IF(SUM(G994:G1001)=0,0,IF(U992=1,IF(OR(G994>L1002,G995>L1002,G996>L1002,G997>L1002,G998>L1002,G999>L1002,G1000>L1002,G1001>L1002,SUM(G994:G1001)>L1002),0,((SUM(G994:G1001)/L1002)*100)),IF(U992=2,IF(OR(G994>100,G995>100,G996>100,G997>100,G998>100,G999>100,G1000>100,G1001>100,SUM(G994:G1001)>100),0,SUM(G994:G1001)))))))","v":0},"Samlet volum for aktuelle elementer:",null,null,null,null,null,null,null,null,1,1]
[null,null,{"$f":"IF(G1002=0,\"0\",IF(U995=2,\"0\",IF(U995=1,(G1002/100)*100,IF(U995=2,(G1002/100)*100))))","v":"0"},{"$f":"G1002","v":0},null,"Total",{"$f":"IF(SUM(G994:G1001)=0,\"1\",SUM(G994:G1001))","v":"1"},{"$f":"SUM(H994:H1001)","v":0},{"$f":"SUM(I994:I1001)","v":0},{"$f":"SUM(J994:J1001)","v":0},{"$f":"SUM(K994:K1001)","v":0},{"$f":"SUM(L994:L1001)","v":0},null,{"$f":"SUM(H1004:L1004)","v":0},{"$f":"IF(G1002<80,\"0,00\",IF(P1003>0,\"0\",IF(G1002>100,\"0,00\",IF(N994>=80,M994,IF(N994<80,0)))))","v":"0,00"},{"$f":"P994+P995+P996+P997+P998+P999+P1000+P1001","v":0},{"$f":"1","v":1},{"$f":"1","v":1}]
[null,null,null,null,null,null,"Percentage",{"$f":"IF(H1003+G1003=0,\"0\",(H1003/G1003)*100)","v":0},{"$f":"IF(I1003+G1003=0,\"0\",(I1003/G1003)*100)","v":0},{"$f":"IF(J1003+G1003=0,\"0\",(J1003/G1003)*100)","v":0},{"$f":"IF(K1003+G1003=0,\"0\",(K1003/G1003)*100)","v":0},{"$f":"IF(L1003+G1003=0,\"0\",(L1003/G1003)*100)","v":0},null,100,null,null,{"$f":"1","v":1},{"$f":"1","v":1}]
[null,null,null,null,null,{"$f":"IF(U995=1,((G1003/100)*80))","v":false},"% of 80",{"$f":"(H1004/80)*100","v":0},{"$f":"(I1004/80)*100","v":0},{"$f":"(J1004/80)*100","v":0},{"$f":"(K1004/80)*100","v":0},{"$f":"(L1004/80)*100","v":0},null,null,null,null,{"$f":"1","v":1},{"$f":"1","v":1}]
[null,null,null,null,null,null,"Limiter",{"$f":"IF(H1005>100,\"100\",H1005)","v":0},{"$f":"IF(I1005>100,\"100\",I1005)","v":0},{"$f":"IF(J1005>100,\"100\",J1005)","v":0},{"$f":"IF(K1005>100,\"100\",K1005)","v":0},{"$f":"IF(L1005>100,\"100\",L1005)","v":0},null,null,null,null,{"$f":"1","v":1},{"$f":"1","v":1}]
[null,null,null,null,null,null,null,null,{"$f":"IF(H1006+I1006+J1006+K1006+L1006=0,0,100-(H1006))","v":0},{"$f":"IF(H1006+I1006+J1006+K1006+L1006=0,0,100-(H1006+I1006))","v":0},{"$f":"IF(J1006+I1006+H1006+K1006+L1006=0,0,100-(J1006+I1006+H1006))","v":0},{"$f":"IF(K1006+J1006+I1006+H1006+L1006=0,0,100-(H1006+I1006+K1006+J1006))","v":0},null,null,null,null,{"$f":"1","v":1},{"$f":"1","v":1}]
[null,null,null,null,null,null,null,null,{"$f":"IF(I1006>I1007,I1007,I1006)","v":0},{"$f":"IF(J1006>J1007,J1007,J1006)","v":0},{"$f":"IF(K1006>K1007,K1007,K1006)","v":0},{"$f":"IF(L1006>L1007,L1007,L1006)","v":0},null,null,null,null,{"$f":"1","v":1},{"$f":"1","v":1}]
[null,null,null,null,null,null,null,null,null,null,null,{"$f":"IF(K1008+J1006+H1006+I1006>=100,0,L1008)","v":0},null,null,null,null,{"$f":"1","v":1},{"$f":"1","v":1}]
[null,null,null,null,null,null,"Scores",{"$f":"IF(H1003=0,0,0.01*(H1006*H1011))","v":0},{"$f":"IF(I1003=0,0,0.01*(I1008*I1011))","v":0},{"$f":"IF(J1003=0,0,0.01*(J1008*J1011))","v":0},{"$f":"IF(K1003=0,0,0.01*(K1008*K1011))","v":0},{"$f":"IF(L1003=0,0,0.01*(L1009*L1011))","v":0},null,null,null,null,{"$f":"1","v":1},{"$f":"1","v":1}]
[null,null,null,null,null,null,null,3,2.5,2,1.5,1,"Total",null,null,null,{"$f":"1","v":1},{"$f":"1","v":1}]
[null,null,"INVENTAR (2)",null,null,"Velg datatype:",null,null,null,null,null,null,null,null,null,null,{"$f":"IF(freq13>=4,0,1)","v":1},{"$f":"1","v":1},null,null,{"$f":"IF(G1012=\"\",2,IF(ISERROR(VLOOKUP(G1012,$T$1246:$U$1247,2,FALSE)),\"\",VLOOKUP(G1012,$T$1246:$U$1247,2,FALSE)))","v":2}]
[null,null,null,{"$f":"IF(AND(P1023>=1,type1=1),\"NB! Volum av nivåene kan ikke være større enn det totale volumet for hvert enkelt materiale!\",+IF(AND(P1023>=1,type1=2),\"NB! Prosentandel for hvert nivå må registreres i prosent av det vurderte bygningselementet, og den totale prosentandelen kan ikke være større enn den totale prosent av hvert enkelt materiale!\",\"\"))","v":""},null,null,null,null,null,null,null,null,null,null,null,null,1,{"$f":"1","v":1}]
[null,null,{"$f":"IF(G1012=\"\",\"\",IF(SUM(G1014:G1021)=0,\"\",IF(U1012=1,IF(U1012+L1022=1,\"REGISTRER DET TOTALE VOLUMET AV RELEVANTE MATERIALER\",IF((U1012+G1022+L1022)=1,\"REGISTRER DET TOTALE VOLUMET AV RELEVANTE MATERIALER\",IF(ISERROR(C1023),\"REGISTRER DET TOTALE VOLUMET AV RELEVANTE MATERIALER\",IF(OR(G1014>L1022,G1015>L1022,G1016>L1022,G1017>L1022,G1018>L1022,G1019>L1022,G1020>L1022,G1021>L1022),\"Volumet av de enkelte materialer kan ikke overstige mengden relevante materialer\",IF(SUM(G1014:G1021)>L1022,\"Den totale mengden av materialer kan ikke overstige det  totale volumet av relevante materialer\",\"\"))))),IF(U1012=2,IF(SUM(G1014:G1021)<80,\"Minst 80 % av de relevante materialer må vurderes, vennligst beregn på nytt.\",IF(OR(G1014>100,G1015>100,G1016>100,G1017>100,G1018>100,G1019>100,G1020>100,G1021>100),\"Prosentandel av de enkelte materialerer kan ikke overstige 100\",IF(SUM(G1014:G1021)>100,\"Den totale prosentandelen av materialer kan ikke overstige 100\",\"\")))))))","v":""},null,"Mat. 1",null,null,null,null,null,null,null,{"$f":"IF(SUM(H1030+I1030+J1030+K1030+L1030)>=3,\"3,00\",SUM(H1030+I1030+J1030+K1030+L1030))","v":0},{"$f":"IF(AND(U1012=1,L1022=\"\"),0,IF(OR(NOT(D1013=\"\"),NOT(C1014=\"\"),NOT(N1015=\"\")),0,IF(ISERROR(N1023),\"0\",N1023)))","v":0},null,{"$f":"IF(SUM(H1014:L1014)>G1014,\"1\",\"0\")","v":"0"},1,{"$f":"1","v":1}]
[null,null,null,null,"Mat. 2",null,null,null,null,null,null,null,null,{"$f":"IF(AND(U1012=1,L1022=\"\"),C1014,+IF(G1023>L1022,C1014,(IF(N1023<80,\"Ingen poeng oppnådd,\nmindre enn 80 % oppfyller kravet\",\"\"))))","v":""},null,{"$f":"IF(SUM(H1015:L1015)>G1015,\"1\",\"0\")","v":"0"},1,{"$f":"1","v":1}]
[null,null,null,null,"Mat. 3",null,null,null,null,null,null,null,null,null,null,"0",1,{"$f":"1","v":1}]
[null,null,null,null,"Mat. 4",null,null,null,null,null,null,null,null,null,null,"0",1,{"$f":"1","v":1}]
[null,null,null,null,"Mat. 5",null,null,null,null,null,null,null,null,null,null,"0",1,{"$f":"1","v":1}]
[null,null,null,null,"Mat. 6",null,null,null,null,null,null,null,null,null,null,"0",1,{"$f":"1","v":1}]
[null,null,null,null,"Mat. 7",null,null,null,null,null,null,null,null,null,null,"0",1,{"$f":"1","v":1}]
[null,null,null,null,"Mat. 8",null,null,null,null,null,null,null,null,null,null,"0",1,{"$f":"1","v":1}]
[null,null,null,null,"Totalt % av bygningselementet (relevante materialer) vurdert:",null,{"$f":"IF(U1012=\"\",0,IF(U1012+L1022=1,0,IF(SUM(G1014:G1021)=0,0,IF(U1012=1,IF(OR(G1014>L1022,G1015>L1022,G1016>L1022,G1017>L1022,G1018>L1022,G1019>L1022,G1020>L1022,G1021>L1022,SUM(G1014:G1021)>L1022),0,((SUM(G1014:G1021)/L1022)*100)),IF(U1012=2,IF(OR(G1014>100,G1015>100,G1016>100,G1017>100,G1018>100,G1019>100,G1020>100,G1021>100,SUM(G1014:G1021)>100),0,SUM(G1014:G1021)))))))","v":0},"Samlet volum for aktuelle elementer:",null,null,null,null,null,null,null,null,1,{"$f":"1","v":1}]
[null,null,{"$f":"IF(G1022=0,\"0\",IF(U1012=2,\"0\",IF(U1012=1,(G1022/100)*100,IF(U1012=2,(G1022/100)*100))))","v":"0"},{"$f":"G1022","v":0},null,"Total",{"$f":"IF(SUM(G1014:G1021)=0,\"1\",SUM(G1014:G1021))","v":"1"},{"$f":"SUM(H1014:H1021)","v":0},{"$f":"SUM(I1014:I1021)","v":0},{"$f":"SUM(J1014:J1021)","v":0},{"$f":"SUM(K1014:K1021)","v":0},{"$f":"SUM(L1014:L1021)","v":0},null,{"$f":"SUM(H1024:L1024)","v":0},{"$f":"IF(G1022<80,\"0,00\",IF(P1023>0,\"0\",IF(G1022>100,\"0,00\",IF(N1014>=80,M1014,IF(N1014<80,0)))))","v":"0,00"},{"$f":"P1014+P1015+P1016+P1017+P1018+P1019+P1020+P1021","v":0},{"$f":"1","v":1},{"$f":"1","v":1}]
[null,null,null,null,null,null,"Percentage",{"$f":"IF(H1023+G1023=0,\"0\",(H1023/G1023)*100)","v":0},{"$f":"IF(I1023+G1023=0,\"0\",(I1023/G1023)*100)","v":0},{"$f":"IF(J1023+G1023=0,\"0\",(J1023/G1023)*100)","v":0},{"$f":"IF(K1023+G1023=0,\"0\",(K1023/G1023)*100)","v":0},{"$f":"IF(L1023+G1023=0,\"0\",(L1023/G1023)*100)","v":0},null,100,null,null,{"$f":"1","v":1},{"$f":"1","v":1}]
[null,null,null,null,null,{"$f":"IF(U1012=1,((G1023/100)*80))","v":false},"% of 80",{"$f":"(H1024/80)*100","v":0},{"$f":"(I1024/80)*100","v":0},{"$f":"(J1024/80)*100","v":0},{"$f":"(K1024/80)*100","v":0},{"$f":"(L1024/80)*100","v":0},null,null,null,null,{"$f":"1","v":1},{"$f":"1","v":1}]
[null,null,null,null,null,null,"Limiter",{"$f":"IF(H1025>100,\"100\",H1025)","v":0},{"$f":"IF(I1025>100,\"100\",I1025)","v":0},{"$f":"IF(J1025>100,\"100\",J1025)","v":0},{"$f":"IF(K1025>100,\"100\",K1025)","v":0},{"$f":"IF(L1025>100,\"100\",L1025)","v":0},null,null,null,null,{"$f":"1","v":1},{"$f":"1","v":1}]
[null,null,null,null,null,null,null,null,{"$f":"IF(H1026+I1026+J1026+K1026+L1026=0,0,100-(H1026))","v":0},{"$f":"IF(H1026+I1026+J1026+K1026+L1026=0,0,100-(H1026+I1026))","v":0},{"$f":"IF(J1026+I1026+H1026+K1026+L1026=0,0,100-(J1026+I1026+H1026))","v":0},{"$f":"IF(K1026+J1026+I1026+H1026+L1026=0,0,100-(H1026+I1026+K1026+J1026))","v":0},null,null,null,null,{"$f":"1","v":1},{"$f":"1","v":1}]
[null,null,null,null,null,null,null,null,{"$f":"IF(I1026>I1027,I1027,I1026)","v":0},{"$f":"IF(J1026>J1027,J1027,J1026)","v":0},{"$f":"IF(K1026>K1027,K1027,K1026)","v":0},{"$f":"IF(L1026>L1027,L1027,L1026)","v":0},null,null,null,null,{"$f":"1","v":1},{"$f":"1","v":1}]
[null,null,null,null,null,null,null,null,null,null,null,{"$f":"IF(K1028+J1026+H1026+I1026>=100,0,L1028)","v":0},null,null,null,null,{"$f":"1","v":1},{"$f":"1","v":1}]
[null,null,null,null,null,null,"Scores",{"$f":"IF(H1023=0,0,0.01*(H1026*H1031))","v":0},{"$f":"IF(I1023=0,0,0.01*(I1028*I1031))","v":0},{"$f":"IF(J1023=0,0,0.01*(J1028*J1031))","v":0},{"$f":"IF(K1023=0,0,0.01*(K1028*K1031))","v":0},{"$f":"IF(L1023=0,0,0.01*(L1029*L1031))","v":0},null,null,null,null,{"$f":"1","v":1},{"$f":"1","v":1}]
[null,null,null,null,null,null,null,3,2.5,2,1.5,1,"Total",null,null,null,{"$f":"1","v":1},{"$f":"1","v":1}]
[null,null,"INVENTAR (3)",null,null,"Velg datatype:",null,null,null,null,null,null,null,null,null,null,{"$f":"IF(freq13>=5,0,1)","v":1},{"$f":"1","v":1},null,null,{"$f":"IF(G1032=\"\",2,IF(ISERROR(VLOOKUP(G1032,$T$1246:$U$1247,2,FALSE)),\"\",VLOOKUP(G1032,$T$1246:$U$1247,2,FALSE)))","v":2}]
[null,null,null,{"$f":"IF(AND(P1043>=1,type1=1),\"NB! Volum av nivåene kan ikke være større enn det totale volumet for hvert enkelt materiale!\",+IF(AND(P1043>=1,type1=2),\"NB! Prosentandel for hvert nivå må registreres i prosent av det vurderte bygningselementet, og den totale prosentandelen kan ikke være større enn den totale prosent av hvert enkelt materiale!\",\"\"))","v":""},null,null,null,null,null,null,null,null,null,null,null,null,1,{"$f":"1","v":1}]
[null,null,{"$f":"IF(G1032=\"\",\"\",IF(SUM(G1034:G1041)=0,\"\",IF(U1032=1,IF(U1032+L1042=1,\"REGISTRER DET TOTALE VOLUMET AV RELEVANTE MATERIALER\",IF((U1032+G1042+L1042)=1,\"REGISTRER DET TOTALE VOLUMET AV RELEVANTE MATERIALER\",IF(ISERROR(C1043),\"REGISTRER DET TOTALE VOLUMET AV RELEVANTE MATERIALER\",IF(OR(G1034>L1042,G1035>L1042,G1036>L1042,G1037>L1042,G1038>L1042,G1039>L1042,G1040>L1042,G1041>L1042),\"Volumet av de enkelte materialer kan ikke overstige mengden relevante materialer\",IF(SUM(G1034:G1041)>L1042,\"Den totale mengden av materialer kan ikke overstige det  totale volumet av relevante materialer\",\"\"))))),IF(U1032=2,IF(SUM(G1034:G1041)<80,\"Minst 80 % av de relevante materialer må vurderes, vennligst beregn på nytt.\",IF(OR(G1034>100,G1035>100,G1036>100,G1037>100,G1038>100,G1039>100,G1040>100,G1041>100),\"Prosentandel av de enkelte materialerer kan ikke overstige 100\",IF(SUM(G1034:G1041)>100,\"Den totale prosentandelen av materialer kan ikke overstige 100\",\"\")))))))","v":""},null,"Mat. 1",null,null,null,null,null,null,null,{"$f":"IF(SUM(H1050+I1050+J1050+K1050+L1050)>=3,\"3,00\",SUM(H1050+I1050+J1050+K1050+L1050))","v":0},{"$f":"IF(AND(U1032=1,L1042=\"\"),0,IF(OR(NOT(D1033=\"\"),NOT(C1034=\"\"),NOT(N1035=\"\")),0,IF(ISERROR(N1043),\"0\",N1043)))","v":0},null,{"$f":"IF(SUM(H1034:L1034)>G1034,\"1\",\"0\")","v":"0"},1,{"$f":"1","v":1}]
[null,null,null,null,"Mat. 2",null,null,null,null,null,null,null,null,{"$f":"IF(AND(U1032=1,L1042=\"\"),C1034,+IF(G1043>L1042,C1034,(IF(N1043<80,\"Ingen poeng oppnådd,\nmindre enn 80 % oppfyller kravet\",\"\"))))","v":""},null,{"$f":"IF(SUM(H1035:L1035)>G1035,\"1\",\"0\")","v":"0"},1,{"$f":"1","v":1}]
[null,null,null,null,"Mat. 3",null,null,null,null,null,null,null,null,null,null,"0",1,{"$f":"1","v":1}]
[null,null,null,null,"Mat. 4",null,null,null,null,null,null,null,null,null,null,"0",1,{"$f":"1","v":1}]
[null,null,null,null,"Mat. 5",null,null,null,null,null,null,null,null,null,null,"0",1,{"$f":"1","v":1}]
[null,null,null,null,"Mat. 6",null,null,null,null,null,null,null,null,null,null,"0",1,{"$f":"1","v":1}]
[null,null,null,null,"Mat. 7",null,null,null,null,null,null,null,null,null,null,"0",1,{"$f":"1","v":1}]
[null,null,null,null,"Mat. 8",null,null,null,null,null,null,null,null,null,null,"0",1,{"$f":"1","v":1}]
[null,null,null,null,"Totalt % av bygningselementet (relevante materialer) vurdert:",null,{"$f":"IF(U1032=\"\",0,IF(U1032+L1042=1,0,IF(SUM(G1034:G1041)=0,0,IF(U1032=1,IF(OR(G1034>L1042,G1035>L1042,G1036>L1042,G1037>L1042,G1038>L1042,G1039>L1042,G1040>L1042,G1041>L1042,SUM(G1034:G1041)>L1042),0,((SUM(G1034:G1041)/L1042)*100)),IF(U1032=2,IF(OR(G1034>100,G1035>100,G1036>100,G1037>100,G1038>100,G1039>100,G1040>100,G1041>100,SUM(G1034:G1041)>100),0,SUM(G1034:G1041)))))))","v":0},"Samlet volum for aktuelle elementer:",null,null,null,null,null,null,null,null,1,{"$f":"1","v":1}]
[null,null,{"$f":"IF(G1042=0,\"0\",IF(U1032=2,\"0\",IF(U1032=1,(G1042/100)*100,IF(U1032=2,(G1042/100)*100))))","v":"0"},{"$f":"G1042","v":0},null,"Total",{"$f":"IF(SUM(G1034:G1041)=0,\"1\",SUM(G1034:G1041))","v":"1"},{"$f":"SUM(H1034:H1041)","v":0},{"$f":"SUM(I1034:I1041)","v":0},{"$f":"SUM(J1034:J1041)","v":0},{"$f":"SUM(K1034:K1041)","v":0},{"$f":"SUM(L1034:L1041)","v":0},null,{"$f":"SUM(H1044:L1044)","v":0},{"$f":"IF(G1042<80,\"0,00\",IF(P1043>0,\"0\",IF(G1042>100,\"0,00\",IF(N1034>=80,M1034,IF(N1034<80,0)))))","v":"0,00"},{"$f":"P1034+P1035+P1036+P1037+P1038+P1039+P1040+P1041","v":0},{"$f":"1","v":1},{"$f":"1","v":1}]
[null,null,null,null,null,null,"Percentage",{"$f":"IF(H1043+G1043=0,\"0\",(H1043/G1043)*100)","v":0},{"$f":"IF(I1043+G1043=0,\"0\",(I1043/G1043)*100)","v":0},{"$f":"IF(J1043+G1043=0,\"0\",(J1043/G1043)*100)","v":0},{"$f":"IF(K1043+G1043=0,\"0\",(K1043/G1043)*100)","v":0},{"$f":"IF(L1043+G1043=0,\"0\",(L1043/G1043)*100)","v":0},null,100,null,null,{"$f":"1","v":1},{"$f":"1","v":1}]
[null,null,null,null,null,{"$f":"IF(U1032=1,((G1043/100)*80))","v":false},"% of 80",{"$f":"(H1044/80)*100","v":0},{"$f":"(I1044/80)*100","v":0},{"$f":"(J1044/80)*100","v":0},{"$f":"(K1044/80)*100","v":0},{"$f":"(L1044/80)*100","v":0},null,null,null,null,{"$f":"1","v":1},{"$f":"1","v":1}]
[null,null,null,null,null,null,"Limiter",{"$f":"IF(H1045>100,\"100\",H1045)","v":0},{"$f":"IF(I1045>100,\"100\",I1045)","v":0},{"$f":"IF(J1045>100,\"100\",J1045)","v":0},{"$f":"IF(K1045>100,\"100\",K1045)","v":0},{"$f":"IF(L1045>100,\"100\",L1045)","v":0},null,null,null,null,{"$f":"1","v":1},{"$f":"1","v":1}]
[null,null,null,null,null,null,null,null,{"$f":"IF(H1046+I1046+J1046+K1046+L1046=0,0,100-(H1046))","v":0},{"$f":"IF(H1046+I1046+J1046+K1046+L1046=0,0,100-(H1046+I1046))","v":0},{"$f":"IF(J1046+I1046+H1046+K1046+L1046=0,0,100-(J1046+I1046+H1046))","v":0},{"$f":"IF(K1046+J1046+I1046+H1046+L1046=0,0,100-(H1046+I1046+K1046+J1046))","v":0},null,null,null,null,{"$f":"1","v":1},{"$f":"1","v":1}]
[null,null,null,null,null,null,null,null,{"$f":"IF(I1046>I1047,I1047,I1046)","v":0},{"$f":"IF(J1046>J1047,J1047,J1046)","v":0},{"$f":"IF(K1046>K1047,K1047,K1046)","v":0},{"$f":"IF(L1046>L1047,L1047,L1046)","v":0},null,null,null,null,{"$f":"1","v":1},{"$f":"1","v":1}]
[null,null,null,null,null,null,null,null,null,null,null,{"$f":"IF(K1048+J1046+H1046+I1046>=100,0,L1048)","v":0},null,null,null,null,{"$f":"1","v":1},{"$f":"1","v":1}]
[null,null,null,null,null,null,"Scores",{"$f":"IF(H1043=0,0,0.01*(H1046*H1051))","v":0},{"$f":"IF(I1043=0,0,0.01*(I1048*I1051))","v":0},{"$f":"IF(J1043=0,0,0.01*(J1048*J1051))","v":0},{"$f":"IF(K1043=0,0,0.01*(K1048*K1051))","v":0},{"$f":"IF(L1043=0,0,0.01*(L1049*L1051))","v":0},null,null,null,null,{"$f":"1","v":1},{"$f":"1","v":1}]
[null,null,null,null,null,null,null,3,2.5,2,1.5,1,"Total",null,null,null,{"$f":"1","v":1},{"$f":"1","v":1}]
[null,null,"INVENTAR (4)",null,null,"Velg datatype:",null,null,null,null,null,null,null,null,null,null,{"$f":"IF(freq13>=6,0,1)","v":1},{"$f":"1","v":1},null,null,{"$f":"IF(G1052=\"\",2,IF(ISERROR(VLOOKUP(G1052,$T$1246:$U$1247,2,FALSE)),\"\",VLOOKUP(G1052,$T$1246:$U$1247,2,FALSE)))","v":2}]
[null,null,null,{"$f":"IF(AND(P1063>=1,type1=1),\"NB! Volum av nivåene kan ikke være større enn det totale volumet for hvert enkelt materiale!\",+IF(AND(P1063>=1,type1=2),\"NB! Prosentandel for hvert nivå må registreres i prosent av det vurderte bygningselementet, og den totale prosentandelen kan ikke være større enn den totale prosent av hvert enkelt materiale!\",\"\"))","v":""},null,null,null,null,null,null,null,null,null,null,null,null,1,{"$f":"1","v":1}]
[null,null,{"$f":"IF(G1052=\"\",\"\",IF(SUM(G1054:G1061)=0,\"\",IF(U1052=1,IF(U1052+L1062=1,\"REGISTRER DET TOTALE VOLUMET AV RELEVANTE MATERIALER\",IF((U1052+G1062+L1062)=1,\"REGISTRER DET TOTALE VOLUMET AV RELEVANTE MATERIALER\",IF(ISERROR(C1063),\"REGISTRER DET TOTALE VOLUMET AV RELEVANTE MATERIALER\",IF(OR(G1054>L1062,G1055>L1062,G1056>L1062,G1057>L1062,G1058>L1062,G1059>L1062,G1060>L1062,G1061>L1062),\"Volumet av de enkelte materialer kan ikke overstige mengden relevante materialer\",IF(SUM(G1054:G1061)>L1062,\"Den totale mengden av materialer kan ikke overstige det  totale volumet av relevante materialer\",\"\"))))),IF(U1052=2,IF(SUM(G1054:G1061)<80,\"Minst 80 % av de relevante materialer må vurderes, vennligst beregn på nytt.\",IF(OR(G1054>100,G1055>100,G1056>100,G1057>100,G1058>100,G1059>100,G1060>100,G1061>100),\"Prosentandel av de enkelte materialerer kan ikke overstige 100\",IF(SUM(G1054:G1061)>100,\"Den totale prosentandelen av materialer kan ikke overstige 100\",\"\")))))))","v":""},null,"Mat. 1",null,null,null,null,null,null,null,{"$f":"IF(SUM(H1070+I1070+J1070+K1070+L1070)>=3,\"3,00\",SUM(H1070+I1070+J1070+K1070+L1070))","v":0},{"$f":"IF(AND(U1052=1,L1062=\"\"),0,IF(OR(NOT(D1053=\"\"),NOT(C1054=\"\"),NOT(N1055=\"\")),0,IF(ISERROR(N1063),\"0\",N1063)))","v":0},null,{"$f":"IF(SUM(H1054:L1054)>G1054,\"1\",\"0\")","v":"0"},1,{"$f":"1","v":1}]
[null,null,null,null,"Mat. 2",null,null,null,null,null,null,null,null,{"$f":"IF(AND(U1052=1,L1062=\"\"),C1054,+IF(G1063>L1062,C1054,(IF(N1063<80,\"Ingen poeng oppnådd,\nmindre enn 80 % oppfyller kravet\",\"\"))))","v":""},null,{"$f":"IF(SUM(H1055:L1055)>G1055,\"1\",\"0\")","v":"0"},1,{"$f":"1","v":1}]
[null,null,null,null,"Mat. 3",null,null,null,null,null,null,null,null,null,null,"0",1,{"$f":"1","v":1}]
[null,null,null,null,"Mat. 4",null,null,null,null,null,null,null,null,null,null,"0",1,{"$f":"1","v":1}]
[null,null,null,null,"Mat. 5",null,null,null,null,null,null,null,null,null,null,"0",1,{"$f":"1","v":1}]
[null,null,null,null,"Mat. 6",null,null,null,null,null,null,null,null,null,null,"0",1,{"$f":"1","v":1}]
[null,null,null,null,"Mat. 7",null,null,null,null,null,null,null,null,null,null,"0",1,{"$f":"1","v":1}]
[null,null,null,null,"Mat. 8",null,null,null,null,null,null,null,null,null,null,"0",1,{"$f":"1","v":1}]
[null,null,null,null,"Totalt % av bygningselementet (relevante materialer) vurdert:",null,{"$f":"IF(U1052=\"\",0,IF(U1052+L1062=1,0,IF(SUM(G1054:G1061)=0,0,IF(U1052=1,IF(OR(G1054>L1062,G1055>L1062,G1056>L1062,G1057>L1062,G1058>L1062,G1059>L1062,G1060>L1062,G1061>L1062,SUM(G1054:G1061)>L1062),0,((SUM(G1054:G1061)/L1062)*100)),IF(U1052=2,IF(OR(G1054>100,G1055>100,G1056>100,G1057>100,G1058>100,G1059>100,G1060>100,G1061>100,SUM(G1054:G1061)>100),0,SUM(G1054:G1061)))))))","v":0},"Samlet volum for aktuelle elementer:",null,null,null,null,null,null,null,null,1,{"$f":"1","v":1}]
[null,null,{"$f":"IF(G1062=0,\"0\",IF(U1052=2,\"0\",IF(U1052=1,(G1062/100)*100,IF(U1052=2,(G1062/100)*100))))","v":"0"},{"$f":"G1062","v":0},null,"Total",{"$f":"IF(SUM(G1054:G1061)=0,\"1\",SUM(G1054:G1061))","v":"1"},{"$f":"SUM(H1054:H1061)","v":0},{"$f":"SUM(I1054:I1061)","v":0},{"$f":"SUM(J1054:J1061)","v":0},{"$f":"SUM(K1054:K1061)","v":0},{"$f":"SUM(L1054:L1061)","v":0},null,{"$f":"SUM(H1064:L1064)","v":0},{"$f":"IF(G1062<80,\"0,00\",IF(P1063>0,\"0\",IF(G1062>100,\"0,00\",IF(N1054>=80,M1054,IF(N1054<80,0)))))","v":"0,00"},{"$f":"P1054+P1055+P1056+P1057+P1058+P1059+P1060+P1061","v":0},{"$f":"1","v":1},{"$f":"1","v":1}]
[null,null,null,null,null,null,"Percentage",{"$f":"IF(H1063+G1063=0,\"0\",(H1063/G1063)*100)","v":0},{"$f":"IF(I1063+G1063=0,\"0\",(I1063/G1063)*100)","v":0},{"$f":"IF(J1063+G1063=0,\"0\",(J1063/G1063)*100)","v":0},{"$f":"IF(K1063+G1063=0,\"0\",(K1063/G1063)*100)","v":0},{"$f":"IF(L1063+G1063=0,\"0\",(L1063/G1063)*100)","v":0},null,100,null,null,{"$f":"1","v":1},{"$f":"1","v":1}]
[null,null,null,null,null,{"$f":"IF(U1052=1,((G1063/100)*80))","v":false},"% of 80",{"$f":"(H1064/80)*100","v":0},{"$f":"(I1064/80)*100","v":0},{"$f":"(J1064/80)*100","v":0},{"$f":"(K1064/80)*100","v":0},{"$f":"(L1064/80)*100","v":0},null,null,null,null,{"$f":"1","v":1},{"$f":"1","v":1}]
[null,null,null,null,null,null,"Limiter",{"$f":"IF(H1065>100,\"100\",H1065)","v":0},{"$f":"IF(I1065>100,\"100\",I1065)","v":0},{"$f":"IF(J1065>100,\"100\",J1065)","v":0},{"$f":"IF(K1065>100,\"100\",K1065)","v":0},{"$f":"IF(L1065>100,\"100\",L1065)","v":0},null,null,null,null,{"$f":"1","v":1},{"$f":"1","v":1}]
[null,null,null,null,null,null,null,null,{"$f":"IF(H1066+I1066+J1066+K1066+L1066=0,0,100-(H1066))","v":0},{"$f":"IF(H1066+I1066+J1066+K1066+L1066=0,0,100-(H1066+I1066))","v":0},{"$f":"IF(J1066+I1066+H1066+K1066+L1066=0,0,100-(J1066+I1066+H1066))","v":0},{"$f":"IF(K1066+J1066+I1066+H1066+L1066=0,0,100-(H1066+I1066+K1066+J1066))","v":0},null,null,null,null,{"$f":"1","v":1},{"$f":"1","v":1}]
[null,null,null,null,null,null,null,null,{"$f":"IF(I1066>I1067,I1067,I1066)","v":0},{"$f":"IF(J1066>J1067,J1067,J1066)","v":0},{"$f":"IF(K1066>K1067,K1067,K1066)","v":0},{"$f":"IF(L1066>L1067,L1067,L1066)","v":0},null,null,null,null,{"$f":"1","v":1},{"$f":"1","v":1}]
[null,null,null,null,null,null,null,null,null,null,null,{"$f":"IF(K1068+J1066+H1066+I1066>=100,0,L1068)","v":0},null,null,null,null,{"$f":"1","v":1},{"$f":"1","v":1}]
[null,null,null,null,null,null,"Scores",{"$f":"IF(H1063=0,0,0.01*(H1066*H1071))","v":0},{"$f":"IF(I1063=0,0,0.01*(I1068*I1071))","v":0},{"$f":"IF(J1063=0,0,0.01*(J1068*J1071))","v":0},{"$f":"IF(K1063=0,0,0.01*(K1068*K1071))","v":0},{"$f":"IF(L1063=0,0,0.01*(L1069*L1071))","v":0},null,null,null,null,{"$f":"1","v":1},{"$f":"1","v":1}]
[null,null,null,null,null,null,null,3,2.5,2,1.5,1,"Total",null,null,null,{"$f":"1","v":1},{"$f":"1","v":1}]
[null,null,"BESLAG",null,null,"Velg antall beslag du ønsker å vurdere (deretter trykk «velg»):",null,null,null,null,{"$f":"IF(AND(G1072=\"\",G1083>0),\"NB! Husk å velge antall elementer...\",\"\")","v":""},null,null,null,{"$f":"IF(ISERROR(O1084+O1104+O1124+O1144)/V1073,\"\",(O1084+O1104+O1124+O1144)/V1073)","v":0},null,{"$f":"0","v":0},{"$f":"IF(asstype=3,0,IF(typescheme=2,0,1))","v":1},null,{"$f":"VLOOKUP(G1072,$T$1239:$U$1243,2,FALSE)","v":2}]
[null,null,{"$f":"IF(G1072=\"\",\"BESLAG\",\"BESLAG (1)\")","v":"BESLAG"},null,null,"Velg datatype:",null,null,null,null,null,null,null,null,null,null,{"$f":"IF(freq14>=3,0,1)","v":1},1,null,null,{"$f":"IF(G1073=\"\",2,IF(ISERROR(VLOOKUP(G1073,$T$1246:$U$1247,2,FALSE)),\"\",VLOOKUP(G1073,$T$1246:$U$1247,2,FALSE)))","v":2},{"$f":"IF(freq14=3,1,IF(freq14=4,2,IF(freq14=5,3,IF(freq14=6,4,1))))","v":1}]
[null,null,null,{"$f":"IF(AND(P1084>=1,type1=1),\"NB! Volum av nivåene kan ikke være større enn det totale volumet for hvert enkelt materiale!\",+IF(AND(P1084>=1,type1=2),\"NB! Prosentandel for hvert nivå må registreres i prosent av det vurderte bygningselementet, og den totale prosentandelen kan ikke være større enn den totale prosent av hvert enkelt materiale!\",\"\"))","v":""},null,null,null,null,null,null,null,null,null,null,null,null,1,1]
[null,null,{"$f":"IF(G1073=\"\",\"\",IF(SUM(G1075:G1082)=0,\"\",IF(U1073=1,IF(U1073+L1083=1,\"REGISTRER DET TOTALE VOLUMET AV RELEVANTE MATERIALER\",IF((U1073+G1083+L1083)=1,\"REGISTRER DET TOTALE VOLUMET AV RELEVANTE MATERIALER\",IF(ISERROR(C1084),\"REGISTRER DET TOTALE VOLUMET AV RELEVANTE MATERIALER\",IF(OR(G1075>L1083,G1076>L1083,G1077>L1083,G1078>L1083,G1079>L1083,G1080>L1083,G1081>L1083,G1082>L1083),\"Volumet av de enkelte materialer kan ikke overstige mengden relevante materialer\",IF(SUM(G1075:G1082)>L1083,\"Den totale mengden av materialer kan ikke overstige det  totale volumet av relevante materialer\",\"\"))))),IF(U1073=2,IF(SUM(G1075:G1082)<80,\"Minst 80 % av de relevante materialer må vurderes, vennligst beregn på nytt.\",IF(OR(G1075>100,G1076>100,G1077>100,G1078>100,G1079>100,G1080>100,G1081>100,G1082>100),\"Prosentandel av de enkelte materialerer kan ikke overstige 100\",IF(SUM(G1075:G1082)>100,\"Den totale prosentandelen av materialer kan ikke overstige 100\",\"\")))))))","v":""},null,"Mat. 1",null,null,null,null,null,null,null,{"$f":"IF(SUM(H1091+I1091+J1091+K1091+L1091)>=3,\"3,00\",SUM(H1091+I1091+J1091+K1091+L1091))","v":0},{"$f":"IF(AND(U1073=1,L1083=\"\"),0,IF(OR(NOT(D1074=\"\"),NOT(C1075=\"\"),NOT(N1076=\"\")),0,IF(ISERROR(N1084),\"0\",N1084)))","v":0},null,{"$f":"IF(SUM(H1075:L1075)>G1075,\"1\",\"0\")","v":"0"},1,1]
[null,null,null,null,"Mat. 2",null,null,null,null,null,null,null,null,{"$f":"IF(AND(U1073=1,L1083=\"\"),C1075,+IF(G1084>L1083,C1075,(IF(N1084<80,\"Ingen poeng oppnådd,\nmindre enn 80 % oppfyller kravet\",\"\"))))","v":""},null,{"$f":"IF(SUM(H1076:L1076)>G1076,\"1\",\"0\")","v":"0"},1,1]
[null,null,null,null,"Mat. 3",null,null,null,null,null,null,null,null,null,null,"0",1,1]
[null,null,null,null,"Mat. 4",null,null,null,null,null,null,null,null,null,null,"0",1,1]
[null,null,null,null,"Mat. 5",null,null,null,null,null,null,null,null,null,null,"0",1,1]
[null,null,null,null,"Mat. 6",null,null,null,null,null,null,null,null,null,null,"0",1,1]
[null,null,null,null,"Mat. 7",null,null,null,null,null,null,null,null,null,null,"0",1,1]
[null,null,null,null,"Mat. 8",null,null,null,null,null,null,null,null,null,null,"0",1,1]
[null,null,null,null,"Totalt % av bygningselementet (relevante materialer) vurdert:",null,{"$f":"IF(U1073=\"\",0,IF(U1073+L1083=1,0,IF(SUM(G1075:G1082)=0,0,IF(U1073=1,IF(OR(G1075>L1083,G1076>L1083,G1077>L1083,G1078>L1083,G1079>L1083,G1080>L1083,G1081>L1083,G1082>L1083,SUM(G1075:G1082)>L1083),0,((SUM(G1075:G1082)/L1083)*100)),IF(U1073=2,IF(OR(G1075>100,G1076>100,G1077>100,G1078>100,G1079>100,G1080>100,G1081>100,G1082>100,SUM(G1075:G1082)>100),0,SUM(G1075:G1082)))))))","v":0},"Samlet volum for aktuelle elementer:",null,null,null,null,null,null,null,null,1,1]
[null,null,{"$f":"IF(G1083=0,\"0\",IF(U1076=2,\"0\",IF(U1076=1,(G1083/100)*100,IF(U1076=2,(G1083/100)*100))))","v":"0"},{"$f":"G1083","v":0},null,"Total",{"$f":"IF(SUM(G1075:G1082)=0,\"1\",SUM(G1075:G1082))","v":"1"},{"$f":"SUM(H1075:H1082)","v":0},{"$f":"SUM(I1075:I1082)","v":0},{"$f":"SUM(J1075:J1082)","v":0},{"$f":"SUM(K1075:K1082)","v":0},{"$f":"SUM(L1075:L1082)","v":0},null,{"$f":"SUM(H1085:L1085)","v":0},{"$f":"IF(G1083<80,\"0,00\",IF(P1084>0,\"0\",IF(G1083>100,\"0,00\",IF(N1075>=80,M1075,IF(N1075<80,0)))))","v":"0,00"},{"$f":"P1075+P1076+P1077+P1078+P1079+P1080+P1081+P1082","v":0},{"$f":"1","v":1},{"$f":"1","v":1}]
[null,null,null,null,null,null,"Percentage",{"$f":"IF(H1084+G1084=0,\"0\",(H1084/G1084)*100)","v":0},{"$f":"IF(I1084+G1084=0,\"0\",(I1084/G1084)*100)","v":0},{"$f":"IF(J1084+G1084=0,\"0\",(J1084/G1084)*100)","v":0},{"$f":"IF(K1084+G1084=0,\"0\",(K1084/G1084)*100)","v":0},{"$f":"IF(L1084+G1084=0,\"0\",(L1084/G1084)*100)","v":0},null,100,null,null,{"$f":"1","v":1},{"$f":"1","v":1}]
[null,null,null,null,null,{"$f":"IF(U1076=1,((G1084/100)*80))","v":false},"% of 80",{"$f":"(H1085/80)*100","v":0},{"$f":"(I1085/80)*100","v":0},{"$f":"(J1085/80)*100","v":0},{"$f":"(K1085/80)*100","v":0},{"$f":"(L1085/80)*100","v":0},null,null,null,null,{"$f":"1","v":1},{"$f":"1","v":1}]
[null,null,null,null,null,null,"Limiter",{"$f":"IF(H1086>100,\"100\",H1086)","v":0},{"$f":"IF(I1086>100,\"100\",I1086)","v":0},{"$f":"IF(J1086>100,\"100\",J1086)","v":0},{"$f":"IF(K1086>100,\"100\",K1086)","v":0},{"$f":"IF(L1086>100,\"100\",L1086)","v":0},null,null,null,null,{"$f":"1","v":1},{"$f":"1","v":1}]
[null,null,null,null,null,null,null,null,{"$f":"IF(H1087+I1087+J1087+K1087+L1087=0,0,100-(H1087))","v":0},{"$f":"IF(H1087+I1087+J1087+K1087+L1087=0,0,100-(H1087+I1087))","v":0},{"$f":"IF(J1087+I1087+H1087+K1087+L1087=0,0,100-(J1087+I1087+H1087))","v":0},{"$f":"IF(K1087+J1087+I1087+H1087+L1087=0,0,100-(H1087+I1087+K1087+J1087))","v":0},null,null,null,null,{"$f":"1","v":1},{"$f":"1","v":1}]
[null,null,null,null,null,null,null,null,{"$f":"IF(I1087>I1088,I1088,I1087)","v":0},{"$f":"IF(J1087>J1088,J1088,J1087)","v":0},{"$f":"IF(K1087>K1088,K1088,K1087)","v":0},{"$f":"IF(L1087>L1088,L1088,L1087)","v":0},null,null,null,null,{"$f":"1","v":1},{"$f":"1","v":1}]
[null,null,null,null,null,null,null,null,null,null,null,{"$f":"IF(K1089+J1087+H1087+I1087>=100,0,L1089)","v":0},null,null,null,null,{"$f":"1","v":1},{"$f":"1","v":1}]
[null,null,null,null,null,null,"Scores",{"$f":"IF(H1084=0,0,0.01*(H1087*H1092))","v":0},{"$f":"IF(I1084=0,0,0.01*(I1089*I1092))","v":0},{"$f":"IF(J1084=0,0,0.01*(J1089*J1092))","v":0},{"$f":"IF(K1084=0,0,0.01*(K1089*K1092))","v":0},{"$f":"IF(L1084=0,0,0.01*(L1090*L1092))","v":0},null,null,null,null,{"$f":"1","v":1},{"$f":"1","v":1}]
[null,null,null,null,null,null,null,3,2.5,2,1.5,1,"Total",null,null,null,{"$f":"1","v":1},{"$f":"1","v":1}]
[null,null,"BESLAG (2)",null,null,"Velg datatype:",null,null,null,null,null,null,null,null,null,null,{"$f":"IF(freq14>=4,0,1)","v":1},{"$f":"1","v":1},null,null,{"$f":"IF(G1093=\"\",2,IF(ISERROR(VLOOKUP(G1093,$T$1246:$U$1247,2,FALSE)),\"\",VLOOKUP(G1093,$T$1246:$U$1247,2,FALSE)))","v":2}]
[null,null,null,{"$f":"IF(AND(P1104>=1,type1=1),\"NB! Volum av nivåene kan ikke være større enn det totale volumet for hvert enkelt materiale!\",+IF(AND(P1104>=1,type1=2),\"NB! Prosentandel for hvert nivå må registreres i prosent av det vurderte bygningselementet, og den totale prosentandelen kan ikke være større enn den totale prosent av hvert enkelt materiale!\",\"\"))","v":""},null,null,null,null,null,null,null,null,null,null,null,null,1,{"$f":"1","v":1}]
[null,null,{"$f":"IF(G1093=\"\",\"\",IF(SUM(G1095:G1102)=0,\"\",IF(U1093=1,IF(U1093+L1103=1,\"REGISTRER DET TOTALE VOLUMET AV RELEVANTE MATERIALER\",IF((U1093+G1103+L1103)=1,\"REGISTRER DET TOTALE VOLUMET AV RELEVANTE MATERIALER\",IF(ISERROR(C1104),\"REGISTRER DET TOTALE VOLUMET AV RELEVANTE MATERIALER\",IF(OR(G1095>L1103,G1096>L1103,G1097>L1103,G1098>L1103,G1099>L1103,G1100>L1103,G1101>L1103,G1102>L1103),\"Volumet av de enkelte materialer kan ikke overstige mengden relevante materialer\",IF(SUM(G1095:G1102)>L1103,\"Den totale mengden av materialer kan ikke overstige det  totale volumet av relevante materialer\",\"\"))))),IF(U1093=2,IF(SUM(G1095:G1102)<80,\"Minst 80 % av de relevante materialer må vurderes, vennligst beregn på nytt.\",IF(OR(G1095>100,G1096>100,G1097>100,G1098>100,G1099>100,G1100>100,G1101>100,G1102>100),\"Prosentandel av de enkelte materialerer kan ikke overstige 100\",IF(SUM(G1095:G1102)>100,\"Den totale prosentandelen av materialer kan ikke overstige 100\",\"\")))))))","v":""},null,"Mat. 1",null,null,null,null,null,null,null,{"$f":"IF(SUM(H1111+I1111+J1111+K1111+L1111)>=3,\"3,00\",SUM(H1111+I1111+J1111+K1111+L1111))","v":0},{"$f":"IF(AND(U1093=1,L1103=\"\"),0,IF(OR(NOT(D1094=\"\"),NOT(C1095=\"\"),NOT(N1096=\"\")),0,IF(ISERROR(N1104),\"0\",N1104)))","v":0},null,{"$f":"IF(SUM(H1095:L1095)>G1095,\"1\",\"0\")","v":"0"},1,{"$f":"1","v":1}]
[null,null,null,null,"Mat. 2",null,null,null,null,null,null,null,null,{"$f":"IF(AND(U1093=1,L1103=\"\"),C1095,+IF(G1104>L1103,C1095,(IF(N1104<80,\"Ingen poeng oppnådd,\nmindre enn 80 % oppfyller kravet\",\"\"))))","v":""},null,{"$f":"IF(SUM(H1096:L1096)>G1096,\"1\",\"0\")","v":"0"},1,{"$f":"1","v":1}]
[null,null,null,null,"Mat. 3",null,null,null,null,null,null,null,null,null,null,"0",1,{"$f":"1","v":1}]
[null,null,null,null,"Mat. 4",null,null,null,null,null,null,null,null,null,null,"0",1,{"$f":"1","v":1}]
[null,null,null,null,"Mat. 5",null,null,null,null,null,null,null,null,null,null,"0",1,{"$f":"1","v":1}]
[null,null,null,null,"Mat. 6",null,null,null,null,null,null,null,null,null,null,"0",1,{"$f":"1","v":1}]
[null,null,null,null,"Mat. 7",null,null,null,null,null,null,null,null,null,null,"0",1,{"$f":"1","v":1}]
[null,null,null,null,"Mat. 8",null,null,null,null,null,null,null,null,null,null,"0",1,{"$f":"1","v":1}]
[null,null,null,null,"Totalt % av bygningselementet (relevante materialer) vurdert:",null,{"$f":"IF(U1093=\"\",0,IF(U1093+L1103=1,0,IF(SUM(G1095:G1102)=0,0,IF(U1093=1,IF(OR(G1095>L1103,G1096>L1103,G1097>L1103,G1098>L1103,G1099>L1103,G1100>L1103,G1101>L1103,G1102>L1103,SUM(G1095:G1102)>L1103),0,((SUM(G1095:G1102)/L1103)*100)),IF(U1093=2,IF(OR(G1095>100,G1096>100,G1097>100,G1098>100,G1099>100,G1100>100,G1101>100,G1102>100,SUM(G1095:G1102)>100),0,SUM(G1095:G1102)))))))","v":0},"Samlet volum for aktuelle elementer:",null,null,null,null,null,null,null,null,1,{"$f":"1","v":1}]
[null,null,{"$f":"IF(G1103=0,\"0\",IF(U1093=2,\"0\",IF(U1093=1,(G1103/100)*100,IF(U1093=2,(G1103/100)*100))))","v":"0"},{"$f":"G1103","v":0},null,"Total",{"$f":"IF(SUM(G1095:G1102)=0,\"1\",SUM(G1095:G1102))","v":"1"},{"$f":"SUM(H1095:H1102)","v":0},{"$f":"SUM(I1095:I1102)","v":0},{"$f":"SUM(J1095:J1102)","v":0},{"$f":"SUM(K1095:K1102)","v":0},{"$f":"SUM(L1095:L1102)","v":0},null,{"$f":"SUM(H1105:L1105)","v":0},{"$f":"IF(G1103<80,\"0,00\",IF(P1104>0,\"0\",IF(G1103>100,\"0,00\",IF(N1095>=80,M1095,IF(N1095<80,0)))))","v":"0,00"},{"$f":"P1095+P1096+P1097+P1098+P1099+P1100+P1101+P1102","v":0},{"$f":"1","v":1},{"$f":"1","v":1}]
[null,null,null,null,null,null,"Percentage",{"$f":"IF(H1104+G1104=0,\"0\",(H1104/G1104)*100)","v":0},{"$f":"IF(I1104+G1104=0,\"0\",(I1104/G1104)*100)","v":0},{"$f":"IF(J1104+G1104=0,\"0\",(J1104/G1104)*100)","v":0},{"$f":"IF(K1104+G1104=0,\"0\",(K1104/G1104)*100)","v":0},{"$f":"IF(L1104+G1104=0,\"0\",(L1104/G1104)*100)","v":0},null,100,null,null,{"$f":"1","v":1},{"$f":"1","v":1}]
[null,null,null,null,null,{"$f":"IF(U1093=1,((G1104/100)*80))","v":false},"% of 80",{"$f":"(H1105/80)*100","v":0},{"$f":"(I1105/80)*100","v":0},{"$f":"(J1105/80)*100","v":0},{"$f":"(K1105/80)*100","v":0},{"$f":"(L1105/80)*100","v":0},null,null,null,null,{"$f":"1","v":1},{"$f":"1","v":1}]
[null,null,null,null,null,null,"Limiter",{"$f":"IF(H1106>100,\"100\",H1106)","v":0},{"$f":"IF(I1106>100,\"100\",I1106)","v":0},{"$f":"IF(J1106>100,\"100\",J1106)","v":0},{"$f":"IF(K1106>100,\"100\",K1106)","v":0},{"$f":"IF(L1106>100,\"100\",L1106)","v":0},null,null,null,null,{"$f":"1","v":1},{"$f":"1","v":1}]
[null,null,null,null,null,null,null,null,{"$f":"IF(H1107+I1107+J1107+K1107+L1107=0,0,100-(H1107))","v":0},{"$f":"IF(H1107+I1107+J1107+K1107+L1107=0,0,100-(H1107+I1107))","v":0},{"$f":"IF(J1107+I1107+H1107+K1107+L1107=0,0,100-(J1107+I1107+H1107))","v":0},{"$f":"IF(K1107+J1107+I1107+H1107+L1107=0,0,100-(H1107+I1107+K1107+J1107))","v":0},null,null,null,null,{"$f":"1","v":1},{"$f":"1","v":1}]
[null,null,null,null,null,null,null,null,{"$f":"IF(I1107>I1108,I1108,I1107)","v":0},{"$f":"IF(J1107>J1108,J1108,J1107)","v":0},{"$f":"IF(K1107>K1108,K1108,K1107)","v":0},{"$f":"IF(L1107>L1108,L1108,L1107)","v":0},null,null,null,null,{"$f":"1","v":1},{"$f":"1","v":1}]
[null,null,null,null,null,null,null,null,null,null,null,{"$f":"IF(K1109+J1107+H1107+I1107>=100,0,L1109)","v":0},null,null,null,null,{"$f":"1","v":1},{"$f":"1","v":1}]
[null,null,null,null,null,null,"Scores",{"$f":"IF(H1104=0,0,0.01*(H1107*H1112))","v":0},{"$f":"IF(I1104=0,0,0.01*(I1109*I1112))","v":0},{"$f":"IF(J1104=0,0,0.01*(J1109*J1112))","v":0},{"$f":"IF(K1104=0,0,0.01*(K1109*K1112))","v":0},{"$f":"IF(L1104=0,0,0.01*(L1110*L1112))","v":0},null,null,null,null,{"$f":"1","v":1},{"$f":"1","v":1}]
[null,null,null,null,null,null,null,3,2.5,2,1.5,1,"Total",null,null,null,{"$f":"1","v":1},{"$f":"1","v":1}]
[null,null,"BESLAG (3)",null,null,"Velg datatype:",null,null,null,null,null,null,null,null,null,null,{"$f":"IF(freq14>=5,0,1)","v":1},{"$f":"1","v":1},null,null,{"$f":"IF(G1113=\"\",2,IF(ISERROR(VLOOKUP(G1113,$T$1246:$U$1247,2,FALSE)),\"\",VLOOKUP(G1113,$T$1246:$U$1247,2,FALSE)))","v":2}]
[null,null,null,{"$f":"IF(AND(P1124>=1,type1=1),\"NB! Volum av nivåene kan ikke være større enn det totale volumet for hvert enkelt materiale!\",+IF(AND(P1124>=1,type1=2),\"NB! Prosentandel for hvert nivå må registreres i prosent av det vurderte bygningselementet, og den totale prosentandelen kan ikke være større enn den totale prosent av hvert enkelt materiale!\",\"\"))","v":""},null,null,null,null,null,null,null,null,null,null,null,null,1,{"$f":"1","v":1}]
[null,null,{"$f":"IF(G1113=\"\",\"\",IF(SUM(G1115:G1122)=0,\"\",IF(U1113=1,IF(U1113+L1123=1,\"REGISTRER DET TOTALE VOLUMET AV RELEVANTE MATERIALER\",IF((U1113+G1123+L1123)=1,\"REGISTRER DET TOTALE VOLUMET AV RELEVANTE MATERIALER\",IF(ISERROR(C1124),\"REGISTRER DET TOTALE VOLUMET AV RELEVANTE MATERIALER\",IF(OR(G1115>L1123,G1116>L1123,G1117>L1123,G1118>L1123,G1119>L1123,G1120>L1123,G1121>L1123,G1122>L1123),\"Volumet av de enkelte materialer kan ikke overstige mengden relevante materialer\",IF(SUM(G1115:G1122)>L1123,\"Den totale mengden av materialer kan ikke overstige det  totale volumet av relevante materialer\",\"\"))))),IF(U1113=2,IF(SUM(G1115:G1122)<80,\"Minst 80 % av de relevante materialer må vurderes, vennligst beregn på nytt.\",IF(OR(G1115>100,G1116>100,G1117>100,G1118>100,G1119>100,G1120>100,G1121>100,G1122>100),\"Prosentandel av de enkelte materialerer kan ikke overstige 100\",IF(SUM(G1115:G1122)>100,\"Den totale prosentandelen av materialer kan ikke overstige 100\",\"\")))))))","v":""},null,"Mat. 1",null,null,null,null,null,null,null,{"$f":"IF(SUM(H1131+I1131+J1131+K1131+L1131)>=3,\"3,00\",SUM(H1131+I1131+J1131+K1131+L1131))","v":0},{"$f":"IF(AND(U1113=1,L1123=\"\"),0,IF(OR(NOT(D1114=\"\"),NOT(C1115=\"\"),NOT(N1116=\"\")),0,IF(ISERROR(N1124),\"0\",N1124)))","v":0},null,{"$f":"IF(SUM(H1115:L1115)>G1115,\"1\",\"0\")","v":"0"},1,{"$f":"1","v":1}]
[null,null,null,null,"Mat. 2",null,null,null,null,null,null,null,null,{"$f":"IF(AND(U1113=1,L1123=\"\"),C1115,+IF(G1124>L1123,C1115,(IF(N1124<80,\"Ingen poeng oppnådd,\nmindre enn 80 % oppfyller kravet\",\"\"))))","v":""},null,{"$f":"IF(SUM(H1116:L1116)>G1116,\"1\",\"0\")","v":"0"},1,{"$f":"1","v":1}]
[null,null,null,null,"Mat. 3",null,null,null,null,null,null,null,null,null,null,"0",1,{"$f":"1","v":1}]
[null,null,null,null,"Mat. 4",null,null,null,null,null,null,null,null,null,null,"0",1,{"$f":"1","v":1}]
[null,null,null,null,"Mat. 5",null,null,null,null,null,null,null,null,null,null,"0",1,{"$f":"1","v":1}]
[null,null,null,null,"Mat. 6",null,null,null,null,null,null,null,null,null,null,"0",1,{"$f":"1","v":1}]
[null,null,null,null,"Mat. 7",null,null,null,null,null,null,null,null,null,null,"0",1,{"$f":"1","v":1}]
[null,null,null,null,"Mat. 8",null,null,null,null,null,null,null,null,null,null,"0",1,{"$f":"1","v":1}]
[null,null,null,null,"Totalt % av bygningselementet (relevante materialer) vurdert:",null,{"$f":"IF(U1113=\"\",0,IF(U1113+L1123=1,0,IF(SUM(G1115:G1122)=0,0,IF(U1113=1,IF(OR(G1115>L1123,G1116>L1123,G1117>L1123,G1118>L1123,G1119>L1123,G1120>L1123,G1121>L1123,G1122>L1123,SUM(G1115:G1122)>L1123),0,((SUM(G1115:G1122)/L1123)*100)),IF(U1113=2,IF(OR(G1115>100,G1116>100,G1117>100,G1118>100,G1119>100,G1120>100,G1121>100,G1122>100,SUM(G1115:G1122)>100),0,SUM(G1115:G1122)))))))","v":0},"Samlet volum for aktuelle elementer:",null,null,null,null,null,null,null,null,1,{"$f":"1","v":1}]
[null,null,{"$f":"IF(G1123=0,\"0\",IF(U1113=2,\"0\",IF(U1113=1,(G1123/100)*100,IF(U1113=2,(G1123/100)*100))))","v":"0"},{"$f":"G1123","v":0},null,"Total",{"$f":"IF(SUM(G1115:G1122)=0,\"1\",SUM(G1115:G1122))","v":"1"},{"$f":"SUM(H1115:H1122)","v":0},{"$f":"SUM(I1115:I1122)","v":0},{"$f":"SUM(J1115:J1122)","v":0},{"$f":"SUM(K1115:K1122)","v":0},{"$f":"SUM(L1115:L1122)","v":0},null,{"$f":"SUM(H1125:L1125)","v":0},{"$f":"IF(G1123<80,\"0,00\",IF(P1124>0,\"0\",IF(G1123>100,\"0,00\",IF(N1115>=80,M1115,IF(N1115<80,0)))))","v":"0,00"},{"$f":"P1115+P1116+P1117+P1118+P1119+P1120+P1121+P1122","v":0},{"$f":"1","v":1},{"$f":"1","v":1}]
[null,null,null,null,null,null,"Percentage",{"$f":"IF(H1124+G1124=0,\"0\",(H1124/G1124)*100)","v":0},{"$f":"IF(I1124+G1124=0,\"0\",(I1124/G1124)*100)","v":0},{"$f":"IF(J1124+G1124=0,\"0\",(J1124/G1124)*100)","v":0},{"$f":"IF(K1124+G1124=0,\"0\",(K1124/G1124)*100)","v":0},{"$f":"IF(L1124+G1124=0,\"0\",(L1124/G1124)*100)","v":0},null,100,null,null,{"$f":"1","v":1},{"$f":"1","v":1}]
[null,null,null,null,null,{"$f":"IF(U1113=1,((G1124/100)*80))","v":false},"% of 80",{"$f":"(H1125/80)*100","v":0},{"$f":"(I1125/80)*100","v":0},{"$f":"(J1125/80)*100","v":0},{"$f":"(K1125/80)*100","v":0},{"$f":"(L1125/80)*100","v":0},null,null,null,null,{"$f":"1","v":1},{"$f":"1","v":1}]
[null,null,null,null,null,null,"Limiter",{"$f":"IF(H1126>100,\"100\",H1126)","v":0},{"$f":"IF(I1126>100,\"100\",I1126)","v":0},{"$f":"IF(J1126>100,\"100\",J1126)","v":0},{"$f":"IF(K1126>100,\"100\",K1126)","v":0},{"$f":"IF(L1126>100,\"100\",L1126)","v":0},null,null,null,null,{"$f":"1","v":1},{"$f":"1","v":1}]
[null,null,null,null,null,null,null,null,{"$f":"IF(H1127+I1127+J1127+K1127+L1127=0,0,100-(H1127))","v":0},{"$f":"IF(H1127+I1127+J1127+K1127+L1127=0,0,100-(H1127+I1127))","v":0},{"$f":"IF(J1127+I1127+H1127+K1127+L1127=0,0,100-(J1127+I1127+H1127))","v":0},{"$f":"IF(K1127+J1127+I1127+H1127+L1127=0,0,100-(H1127+I1127+K1127+J1127))","v":0},null,null,null,null,{"$f":"1","v":1},{"$f":"1","v":1}]
[null,null,null,null,null,null,null,null,{"$f":"IF(I1127>I1128,I1128,I1127)","v":0},{"$f":"IF(J1127>J1128,J1128,J1127)","v":0},{"$f":"IF(K1127>K1128,K1128,K1127)","v":0},{"$f":"IF(L1127>L1128,L1128,L1127)","v":0},null,null,null,null,{"$f":"1","v":1},{"$f":"1","v":1}]
[null,null,null,null,null,null,null,null,null,null,null,{"$f":"IF(K1129+J1127+H1127+I1127>=100,0,L1129)","v":0},null,null,null,null,{"$f":"1","v":1},{"$f":"1","v":1}]
[null,null,null,null,null,null,"Scores",{"$f":"IF(H1124=0,0,0.01*(H1127*H1132))","v":0},{"$f":"IF(I1124=0,0,0.01*(I1129*I1132))","v":0},{"$f":"IF(J1124=0,0,0.01*(J1129*J1132))","v":0},{"$f":"IF(K1124=0,0,0.01*(K1129*K1132))","v":0},{"$f":"IF(L1124=0,0,0.01*(L1130*L1132))","v":0},null,null,null,null,{"$f":"1","v":1},{"$f":"1","v":1}]
[null,null,null,null,null,null,null,3,2.5,2,1.5,1,"Total",null,null,null,{"$f":"1","v":1},{"$f":"1","v":1}]
[null,null,"BESLAG (4)",null,null,"Velg datatype:",null,null,null,null,null,null,null,null,null,null,{"$f":"IF(freq14>=6,0,1)","v":1},{"$f":"1","v":1},null,null,{"$f":"IF(G1133=\"\",2,IF(ISERROR(VLOOKUP(G1133,$T$1246:$U$1247,2,FALSE)),\"\",VLOOKUP(G1133,$T$1246:$U$1247,2,FALSE)))","v":2}]
[null,null,null,{"$f":"IF(AND(P1144>=1,type1=1),\"NB! Volum av nivåene kan ikke være større enn det totale volumet for hvert enkelt materiale!\",+IF(AND(P1144>=1,type1=2),\"NB! Prosentandel for hvert nivå må registreres i prosent av det vurderte bygningselementet, og den totale prosentandelen kan ikke være større enn den totale prosent av hvert enkelt materiale!\",\"\"))","v":""},null,null,null,null,null,null,null,null,null,null,null,null,1,{"$f":"1","v":1}]
[null,null,{"$f":"IF(G1133=\"\",\"\",IF(SUM(G1135:G1142)=0,\"\",IF(U1133=1,IF(U1133+L1143=1,\"REGISTRER DET TOTALE VOLUMET AV RELEVANTE MATERIALER\",IF((U1133+G1143+L1143)=1,\"REGISTRER DET TOTALE VOLUMET AV RELEVANTE MATERIALER\",IF(ISERROR(C1144),\"REGISTRER DET TOTALE VOLUMET AV RELEVANTE MATERIALER\",IF(OR(G1135>L1143,G1136>L1143,G1137>L1143,G1138>L1143,G1139>L1143,G1140>L1143,G1141>L1143,G1142>L1143),\"Volumet av de enkelte materialer kan ikke overstige mengden relevante materialer\",IF(SUM(G1135:G1142)>L1143,\"Den totale mengden av materialer kan ikke overstige det  totale volumet av relevante materialer\",\"\"))))),IF(U1133=2,IF(SUM(G1135:G1142)<80,\"Minst 80 % av de relevante materialer må vurderes, vennligst beregn på nytt.\",IF(OR(G1135>100,G1136>100,G1137>100,G1138>100,G1139>100,G1140>100,G1141>100,G1142>100),\"Prosentandel av de enkelte materialerer kan ikke overstige 100\",IF(SUM(G1135:G1142)>100,\"Den totale prosentandelen av materialer kan ikke overstige 100\",\"\")))))))","v":""},null,"Mat. 1",null,null,null,null,null,null,null,{"$f":"IF(SUM(H1151+I1151+J1151+K1151+L1151)>=3,\"3,00\",SUM(H1151+I1151+J1151+K1151+L1151))","v":0},{"$f":"IF(AND(U1133=1,L1143=\"\"),0,IF(OR(NOT(D1134=\"\"),NOT(C1135=\"\"),NOT(N1136=\"\")),0,IF(ISERROR(N1144),\"0\",N1144)))","v":0},null,{"$f":"IF(SUM(H1135:L1135)>G1135,\"1\",\"0\")","v":"0"},1,{"$f":"1","v":1}]
[null,null,null,null,"Mat. 2",null,null,null,null,null,null,null,null,{"$f":"IF(AND(U1133=1,L1143=\"\"),C1135,+IF(G1144>L1143,C1135,(IF(N1144<80,\"Ingen poeng oppnådd,\nmindre enn 80 % oppfyller kravet\",\"\"))))","v":""},null,{"$f":"IF(SUM(H1136:L1136)>G1136,\"1\",\"0\")","v":"0"},1,{"$f":"1","v":1}]
[null,null,null,null,"Mat. 3",null,null,null,null,null,null,null,null,null,null,"0",1,{"$f":"1","v":1}]
[null,null,null,null,"Mat. 4",null,null,null,null,null,null,null,null,null,null,"0",1,{"$f":"1","v":1}]
[null,null,null,null,"Mat. 5",null,null,null,null,null,null,null,null,null,null,"0",1,{"$f":"1","v":1}]
[null,null,null,null,"Mat. 6",null,null,null,null,null,null,null,null,null,null,"0",1,{"$f":"1","v":1}]
[null,null,null,null,"Mat. 7",null,null,null,null,null,null,null,null,null,null,"0",1,{"$f":"1","v":1}]
[null,null,null,null,"Mat. 8",null,null,null,null,null,null,null,null,null,null,"0",1,{"$f":"1","v":1}]
[null,null,null,null,"Totalt % av bygningselementet (relevante materialer) vurdert:",null,{"$f":"IF(U1133=\"\",0,IF(U1133+L1143=1,0,IF(SUM(G1135:G1142)=0,0,IF(U1133=1,IF(OR(G1135>L1143,G1136>L1143,G1137>L1143,G1138>L1143,G1139>L1143,G1140>L1143,G1141>L1143,G1142>L1143,SUM(G1135:G1142)>L1143),0,((SUM(G1135:G1142)/L1143)*100)),IF(U1133=2,IF(OR(G1135>100,G1136>100,G1137>100,G1138>100,G1139>100,G1140>100,G1141>100,G1142>100,SUM(G1135:G1142)>100),0,SUM(G1135:G1142)))))))","v":0},"Samlet volum for aktuelle elementer:",null,null,null,null,null,null,null,null,1,{"$f":"1","v":1}]
[null,null,{"$f":"IF(G1143=0,\"0\",IF(U1133=2,\"0\",IF(U1133=1,(G1143/100)*100,IF(U1133=2,(G1143/100)*100))))","v":"0"},{"$f":"G1143","v":0},null,"Total",{"$f":"IF(SUM(G1135:G1142)=0,\"1\",SUM(G1135:G1142))","v":"1"},{"$f":"SUM(H1135:H1142)","v":0},{"$f":"SUM(I1135:I1142)","v":0},{"$f":"SUM(J1135:J1142)","v":0},{"$f":"SUM(K1135:K1142)","v":0},{"$f":"SUM(L1135:L1142)","v":0},null,{"$f":"SUM(H1145:L1145)","v":0},{"$f":"IF(G1143<80,\"0,00\",IF(P1144>0,\"0\",IF(G1143>100,\"0,00\",IF(N1135>=80,M1135,IF(N1135<80,0)))))","v":"0,00"},{"$f":"P1135+P1136+P1137+P1138+P1139+P1140+P1141+P1142","v":0},{"$f":"1","v":1},{"$f":"1","v":1}]
[null,null,null,null,null,null,"Percentage",{"$f":"IF(H1144+G1144=0,\"0\",(H1144/G1144)*100)","v":0},{"$f":"IF(I1144+G1144=0,\"0\",(I1144/G1144)*100)","v":0},{"$f":"IF(J1144+G1144=0,\"0\",(J1144/G1144)*100)","v":0},{"$f":"IF(K1144+G1144=0,\"0\",(K1144/G1144)*100)","v":0},{"$f":"IF(L1144+G1144=0,\"0\",(L1144/G1144)*100)","v":0},null,100,null,null,{"$f":"1","v":1},{"$f":"1","v":1}]
[null,null,null,null,null,{"$f":"IF(U1133=1,((G1144/100)*80))","v":false},"% of 80",{"$f":"(H1145/80)*100","v":0},{"$f":"(I1145/80)*100","v":0},{"$f":"(J1145/80)*100","v":0},{"$f":"(K1145/80)*100","v":0},{"$f":"(L1145/80)*100","v":0},null,null,null,null,{"$f":"1","v":1},{"$f":"1","v":1}]
[null,null,null,null,null,null,"Limiter",{"$f":"IF(H1146>100,\"100\",H1146)","v":0},{"$f":"IF(I1146>100,\"100\",I1146)","v":0},{"$f":"IF(J1146>100,\"100\",J1146)","v":0},{"$f":"IF(K1146>100,\"100\",K1146)","v":0},{"$f":"IF(L1146>100,\"100\",L1146)","v":0},null,null,null,null,{"$f":"1","v":1},{"$f":"1","v":1}]
[null,null,null,null,null,null,null,null,{"$f":"IF(H1147+I1147+J1147+K1147+L1147=0,0,100-(H1147))","v":0},{"$f":"IF(H1147+I1147+J1147+K1147+L1147=0,0,100-(H1147+I1147))","v":0},{"$f":"IF(J1147+I1147+H1147+K1147+L1147=0,0,100-(J1147+I1147+H1147))","v":0},{"$f":"IF(K1147+J1147+I1147+H1147+L1147=0,0,100-(H1147+I1147+K1147+J1147))","v":0},null,null,null,null,{"$f":"1","v":1},{"$f":"1","v":1}]
[null,null,null,null,null,null,null,null,{"$f":"IF(I1147>I1148,I1148,I1147)","v":0},{"$f":"IF(J1147>J1148,J1148,J1147)","v":0},{"$f":"IF(K1147>K1148,K1148,K1147)","v":0},{"$f":"IF(L1147>L1148,L1148,L1147)","v":0},null,null,null,null,{"$f":"1","v":1},{"$f":"1","v":1}]
[null,null,null,null,null,null,null,null,null,null,null,{"$f":"IF(K1149+J1147+H1147+I1147>=100,0,L1149)","v":0},null,null,null,null,{"$f":"1","v":1},{"$f":"1","v":1}]
[null,null,null,null,null,null,"Scores",{"$f":"IF(H1144=0,0,0.01*(H1147*H1152))","v":0},{"$f":"IF(I1144=0,0,0.01*(I1149*I1152))","v":0},{"$f":"IF(J1144=0,0,0.01*(J1149*J1152))","v":0},{"$f":"IF(K1144=0,0,0.01*(K1149*K1152))","v":0},{"$f":"IF(L1144=0,0,0.01*(L1150*L1152))","v":0},null,null,null,null,{"$f":"1","v":1},{"$f":"1","v":1}]
[null,null,null,null,null,null,null,3,2.5,2,1.5,1,"Total",null,null,null,{"$f":"1","v":1},{"$f":"1","v":1}]
[null,null," ANNEN BETYDELIG BRUK",null,null,"Velg antall «annen betydelig bruk» du ønsker å vurdere (deretter trykk «velg»):",null,null,null,null,{"$f":"IF(AND(G1153=\"\",G1164>0),\"NB! Husk å velge antall elementer...\",\"\")","v":""},null,null,null,{"$f":"IF(ISERROR(O1165+O1185+O1205+O1225)/V1154,\"\",(O1165+O1185+O1205+O1225)/V1154)","v":0},null,{"$f":"0","v":0},{"$f":"IF(asstype=3,0,IF(typescheme=2,0,1))","v":1},null,{"$f":"VLOOKUP(G1153,$T$1239:$U$1243,2,FALSE)","v":2}]
[null,null,{"$f":"IF(G1153=\"\",\" ANNEN BETYDELIG BRUK\",\"ANNEN BETYDELIG BRUK (1)\")","v":" ANNEN BETYDELIG BRUK"},null,null,"Velg datatype:",null,null,null,null,null,null,null,null,null,null,{"$f":"IF(freq15>=3,0,1)","v":1},1,null,null,{"$f":"IF(G1154=\"\",2,IF(ISERROR(VLOOKUP(G1154,$T$1246:$U$1247,2,FALSE)),\"\",VLOOKUP(G1154,$T$1246:$U$1247,2,FALSE)))","v":2},{"$f":"IF(freq15=3,1,IF(freq15=4,2,IF(freq15=5,3,IF(freq15=6,4,1))))","v":1}]
[null,null,null,{"$f":"IF(AND(P1165>=1,type1=1),\"NB! Volum av nivåene kan ikke være større enn det totale volumet for hvert enkelt materiale!\",+IF(AND(P1165>=1,type1=2),\"NB! Prosentandel for hvert nivå må registreres i prosent av det vurderte bygningselementet, og den totale prosentandelen kan ikke være større enn den totale prosent av hvert enkelt materiale!\",\"\"))","v":""},null,null,null,null,null,null,null,null,null,null,null,null,{"$f":"IF(freq15>=3,0,1)","v":1},1]
[null,null,{"$f":"IF(G1154=\"\",\"\",IF(SUM(G1156:G1163)=0,\"\",IF(U1154=1,IF(U1154+L1164=1,\"REGISTRER DET TOTALE VOLUMET AV RELEVANTE MATERIALER\",IF((U1154+G1164+L1164)=1,\"REGISTRER DET TOTALE VOLUMET AV RELEVANTE MATERIALER\",IF(ISERROR(C1165),\"REGISTRER DET TOTALE VOLUMET AV RELEVANTE MATERIALER\",IF(OR(G1156>L1164,G1157>L1164,G1158>L1164,G1159>L1164,G1160>L1164,G1161>L1164,G1162>L1164,G1163>L1164),\"Volumet av de enkelte materialer kan ikke overstige mengden relevante materialer\",IF(SUM(G1156:G1163)>L1164,\"Den totale mengden av materialer kan ikke overstige det  totale volumet av relevante materialer\",\"\"))))),IF(U1154=2,IF(SUM(G1156:G1163)<80,\"Minst 80 % av de relevante materialer må vurderes, vennligst beregn på nytt.\",IF(OR(G1156>100,G1157>100,G1158>100,G1159>100,G1160>100,G1161>100,G1162>100,G1163>100),\"Prosentandel av de enkelte materialerer kan ikke overstige 100\",IF(SUM(G1156:G1163)>100,\"Den totale prosentandelen av materialer kan ikke overstige 100\",\"\")))))))","v":""},null,"Mat. 1",null,null,null,null,null,null,null,{"$f":"IF(SUM(H1172+I1172+J1172+K1172+L1172)>=3,\"3,00\",SUM(H1172+I1172+J1172+K1172+L1172))","v":0},{"$f":"IF(AND(U1154=1,L1164=\"\"),0,IF(OR(NOT(D1155=\"\"),NOT(C1156=\"\"),NOT(N1157=\"\")),0,IF(ISERROR(N1165),\"0\",N1165)))","v":0},null,{"$f":"IF(SUM(H1156:L1156)>G1156,\"1\",\"0\")","v":"0"},1,1]
[null,null,null,null,"Mat. 2",null,null,null,null,null,null,null,null,{"$f":"IF(AND(U1154=1,L1164=\"\"),C1156,+IF(G1165>L1164,C1156,(IF(N1165<80,\"Ingen poeng oppnådd,\nmindre enn 80 % oppfyller kravet\",\"\"))))","v":""},null,{"$f":"IF(SUM(H1157:L1157)>G1157,\"1\",\"0\")","v":"0"},1,1]
[null,null,null,null,"Mat. 3",null,null,null,null,null,null,null,null,null,null,"0",1,1]
[null,null,null,null,"Mat. 4",null,null,null,null,null,null,null,null,null,null,"0",1,1]
[null,null,null,null,"Mat. 5",null,null,null,null,null,null,null,null,null,null,"0",1,1]
[null,null,null,null,"Mat. 6",null,null,null,null,null,null,null,null,null,null,"0",1,1]
[null,null,null,null,"Mat. 7",null,null,null,null,null,null,null,null,null,null,"0",1,1]
[null,null,null,null,"Mat. 8",null,null,null,null,null,null,null,null,null,null,"0",1,1]
[null,null,null,null,"Totalt % av bygningselementet (relevante materialer) vurdert:",null,{"$f":"IF(U1154=\"\",0,IF(U1154+L1164=1,0,IF(SUM(G1156:G1163)=0,0,IF(U1154=1,IF(OR(G1156>L1164,G1157>L1164,G1158>L1164,G1159>L1164,G1160>L1164,G1161>L1164,G1162>L1164,G1163>L1164,SUM(G1156:G1163)>L1164),0,((SUM(G1156:G1163)/L1164)*100)),IF(U1154=2,IF(OR(G1156>100,G1157>100,G1158>100,G1159>100,G1160>100,G1161>100,G1162>100,G1163>100,SUM(G1156:G1163)>100),0,SUM(G1156:G1163)))))))","v":0},"Samlet volum for aktuelle elementer:",null,null,null,null,null,null,null,null,1,1]
[null,null,{"$f":"IF(G1164=0,\"0\",IF(U1157=2,\"0\",IF(U1157=1,(G1164/100)*100,IF(U1157=2,(G1164/100)*100))))","v":"0"},{"$f":"G1164","v":0},null,"Total",{"$f":"IF(SUM(G1156:G1163)=0,\"1\",SUM(G1156:G1163))","v":"1"},{"$f":"SUM(H1156:H1163)","v":0},{"$f":"SUM(I1156:I1163)","v":0},{"$f":"SUM(J1156:J1163)","v":0},{"$f":"SUM(K1156:K1163)","v":0},{"$f":"SUM(L1156:L1163)","v":0},null,{"$f":"SUM(H1166:L1166)","v":0},{"$f":"IF(G1164<80,\"0,00\",IF(P1165>0,\"0\",IF(G1164>100,\"0,00\",IF(N1156>=80,M1156,IF(N1156<80,0)))))","v":"0,00"},{"$f":"P1156+P1157+P1158+P1159+P1160+P1161+P1162+P1163","v":0},{"$f":"1","v":1},{"$f":"1","v":1}]
[null,null,null,null,null,null,"Percentage",{"$f":"IF(H1165+G1165=0,\"0\",(H1165/G1165)*100)","v":0},{"$f":"IF(I1165+G1165=0,\"0\",(I1165/G1165)*100)","v":0},{"$f":"IF(J1165+G1165=0,\"0\",(J1165/G1165)*100)","v":0},{"$f":"IF(K1165+G1165=0,\"0\",(K1165/G1165)*100)","v":0},{"$f":"IF(L1165+G1165=0,\"0\",(L1165/G1165)*100)","v":0},null,100,null,null,{"$f":"1","v":1},{"$f":"1","v":1}]
[null,null,null,null,null,{"$f":"IF(U1157=1,((G1165/100)*80))","v":false},"% of 80",{"$f":"(H1166/80)*100","v":0},{"$f":"(I1166/80)*100","v":0},{"$f":"(J1166/80)*100","v":0},{"$f":"(K1166/80)*100","v":0},{"$f":"(L1166/80)*100","v":0},null,null,null,null,{"$f":"1","v":1},{"$f":"1","v":1}]
[null,null,null,null,null,null,"Limiter",{"$f":"IF(H1167>100,\"100\",H1167)","v":0},{"$f":"IF(I1167>100,\"100\",I1167)","v":0},{"$f":"IF(J1167>100,\"100\",J1167)","v":0},{"$f":"IF(K1167>100,\"100\",K1167)","v":0},{"$f":"IF(L1167>100,\"100\",L1167)","v":0},null,null,null,null,{"$f":"1","v":1},{"$f":"1","v":1}]
[null,null,null,null,null,null,null,null,{"$f":"IF(H1168+I1168+J1168+K1168+L1168=0,0,100-(H1168))","v":0},{"$f":"IF(H1168+I1168+J1168+K1168+L1168=0,0,100-(H1168+I1168))","v":0},{"$f":"IF(J1168+I1168+H1168+K1168+L1168=0,0,100-(J1168+I1168+H1168))","v":0},{"$f":"IF(K1168+J1168+I1168+H1168+L1168=0,0,100-(H1168+I1168+K1168+J1168))","v":0},null,null,null,null,{"$f":"1","v":1},{"$f":"1","v":1}]
[null,null,null,null,null,null,null,null,{"$f":"IF(I1168>I1169,I1169,I1168)","v":0},{"$f":"IF(J1168>J1169,J1169,J1168)","v":0},{"$f":"IF(K1168>K1169,K1169,K1168)","v":0},{"$f":"IF(L1168>L1169,L1169,L1168)","v":0},null,null,null,null,{"$f":"1","v":1},{"$f":"1","v":1}]
[null,null,null,null,null,null,null,null,null,null,null,{"$f":"IF(K1170+J1168+H1168+I1168>=100,0,L1170)","v":0},null,null,null,null,{"$f":"1","v":1},{"$f":"1","v":1}]
[null,null,null,null,null,null,"Scores",{"$f":"IF(H1165=0,0,0.01*(H1168*H1173))","v":0},{"$f":"IF(I1165=0,0,0.01*(I1170*I1173))","v":0},{"$f":"IF(J1165=0,0,0.01*(J1170*J1173))","v":0},{"$f":"IF(K1165=0,0,0.01*(K1170*K1173))","v":0},{"$f":"IF(L1165=0,0,0.01*(L1171*L1173))","v":0},null,null,null,null,{"$f":"1","v":1},{"$f":"1","v":1}]
[null,null,null,null,null,null,null,3,2.5,2,1.5,1,"Total",null,null,null,{"$f":"1","v":1},{"$f":"1","v":1}]
[null,null," ANNEN BETYDELIG BRUK (2)",null,null,"Velg datatype:",null,null,null,null,null,null,null,null,null,null,{"$f":"IF(freq15>=4,0,1)","v":1},{"$f":"1","v":1},null,null,{"$f":"IF(G1174=\"\",2,IF(ISERROR(VLOOKUP(G1174,$T$1246:$U$1247,2,FALSE)),\"\",VLOOKUP(G1174,$T$1246:$U$1247,2,FALSE)))","v":2}]
[null,null,null,{"$f":"IF(AND(P1185>=1,type1=1),\"NB! Volum av nivåene kan ikke være større enn det totale volumet for hvert enkelt materiale!\",+IF(AND(P1185>=1,type1=2),\"NB! Prosentandel for hvert nivå må registreres i prosent av det vurderte bygningselementet, og den totale prosentandelen kan ikke være større enn den totale prosent av hvert enkelt materiale!\",\"\"))","v":""},null,null,null,null,null,null,null,null,null,null,null,null,1,{"$f":"1","v":1}]
[null,null,{"$f":"IF(G1174=\"\",\"\",IF(SUM(G1176:G1183)=0,\"\",IF(U1174=1,IF(U1174+L1184=1,\"REGISTRER DET TOTALE VOLUMET AV RELEVANTE MATERIALER\",IF((U1174+G1184+L1184)=1,\"REGISTRER DET TOTALE VOLUMET AV RELEVANTE MATERIALER\",IF(ISERROR(C1185),\"REGISTRER DET TOTALE VOLUMET AV RELEVANTE MATERIALER\",IF(OR(G1176>L1184,G1177>L1184,G1178>L1184,G1179>L1184,G1180>L1184,G1181>L1184,G1182>L1184,G1183>L1184),\"Volumet av de enkelte materialer kan ikke overstige mengden relevante materialer\",IF(SUM(G1176:G1183)>L1184,\"Den totale mengden av materialer kan ikke overstige det  totale volumet av relevante materialer\",\"\"))))),IF(U1174=2,IF(SUM(G1176:G1183)<80,\"Minst 80 % av de relevante materialer må vurderes, vennligst beregn på nytt.\",IF(OR(G1176>100,G1177>100,G1178>100,G1179>100,G1180>100,G1181>100,G1182>100,G1183>100),\"Prosentandel av de enkelte materialerer kan ikke overstige 100\",IF(SUM(G1176:G1183)>100,\"Den totale prosentandelen av materialer kan ikke overstige 100\",\"\")))))))","v":""},null,"Mat. 1",null,null,null,null,null,null,null,{"$f":"IF(SUM(H1192+I1192+J1192+K1192+L1192)>=3,\"3,00\",SUM(H1192+I1192+J1192+K1192+L1192))","v":0},{"$f":"IF(AND(U1174=1,L1184=\"\"),0,IF(OR(NOT(D1175=\"\"),NOT(C1176=\"\"),NOT(N1177=\"\")),0,IF(ISERROR(N1185),\"0\",N1185)))","v":0},null,{"$f":"IF(SUM(H1176:L1176)>G1176,\"1\",\"0\")","v":"0"},1,{"$f":"1","v":1}]
[null,null,null,null,"Mat. 2",null,null,null,null,null,null,null,null,{"$f":"IF(AND(U1174=1,L1184=\"\"),C1176,+IF(G1185>L1184,C1176,(IF(N1185<80,\"Ingen poeng oppnådd,\nmindre enn 80 % oppfyller kravet\",\"\"))))","v":""},null,{"$f":"IF(SUM(H1177:L1177)>G1177,\"1\",\"0\")","v":"0"},1,{"$f":"1","v":1}]
[null,null,null,null,"Mat. 3",null,null,null,null,null,null,null,null,null,null,"0",1,{"$f":"1","v":1}]
[null,null,null,null,"Mat. 4",null,null,null,null,null,null,null,null,null,null,"0",1,{"$f":"1","v":1}]
[null,null,null,null,"Mat. 5",null,null,null,null,null,null,null,null,null,null,"0",1,{"$f":"1","v":1}]
[null,null,null,null,"Mat. 6",null,null,null,null,null,null,null,null,null,null,"0",1,{"$f":"1","v":1}]
[null,null,null,null,"Mat. 7",null,null,null,null,null,null,null,null,null,null,"0",1,{"$f":"1","v":1}]
[null,null,null,null,"Mat. 8",null,null,null,null,null,null,null,null,null,null,"0",1,{"$f":"1","v":1}]
[null,null,null,null,"Totalt % av bygningselementet (relevante materialer) vurdert:",null,{"$f":"IF(U1174=\"\",0,IF(U1174+L1184=1,0,IF(SUM(G1176:G1183)=0,0,IF(U1174=1,IF(OR(G1176>L1184,G1177>L1184,G1178>L1184,G1179>L1184,G1180>L1184,G1181>L1184,G1182>L1184,G1183>L1184,SUM(G1176:G1183)>L1184),0,((SUM(G1176:G1183)/L1184)*100)),IF(U1174=2,IF(OR(G1176>100,G1177>100,G1178>100,G1179>100,G1180>100,G1181>100,G1182>100,G1183>100,SUM(G1176:G1183)>100),0,SUM(G1176:G1183)))))))","v":0},"Samlet volum for aktuelle elementer:",null,null,null,null,null,null,null,null,1,{"$f":"1","v":1}]
[null,null,{"$f":"IF(G1184=0,\"0\",IF(U1174=2,\"0\",IF(U1174=1,(G1184/100)*100,IF(U1174=2,(G1184/100)*100))))","v":"0"},{"$f":"G1184","v":0},null,"Total",{"$f":"IF(SUM(G1176:G1183)=0,\"1\",SUM(G1176:G1183))","v":"1"},{"$f":"SUM(H1176:H1183)","v":0},{"$f":"SUM(I1176:I1183)","v":0},{"$f":"SUM(J1176:J1183)","v":0},{"$f":"SUM(K1176:K1183)","v":0},{"$f":"SUM(L1176:L1183)","v":0},null,{"$f":"SUM(H1186:L1186)","v":0},{"$f":"IF(G1184<80,\"0,00\",IF(P1185>0,\"0\",IF(G1184>100,\"0,00\",IF(N1176>=80,M1176,IF(N1176<80,0)))))","v":"0,00"},{"$f":"P1176+P1177+P1178+P1179+P1180+P1181+P1182+P1183","v":0},{"$f":"1","v":1},{"$f":"1","v":1}]
[null,null,null,null,null,null,"Percentage",{"$f":"IF(H1185+G1185=0,\"0\",(H1185/G1185)*100)","v":0},{"$f":"IF(I1185+G1185=0,\"0\",(I1185/G1185)*100)","v":0},{"$f":"IF(J1185+G1185=0,\"0\",(J1185/G1185)*100)","v":0},{"$f":"IF(K1185+G1185=0,\"0\",(K1185/G1185)*100)","v":0},{"$f":"IF(L1185+G1185=0,\"0\",(L1185/G1185)*100)","v":0},null,100,null,null,{"$f":"1","v":1},{"$f":"1","v":1}]
[null,null,null,null,null,{"$f":"IF(U1174=1,((G1185/100)*80))","v":false},"% of 80",{"$f":"(H1186/80)*100","v":0},{"$f":"(I1186/80)*100","v":0},{"$f":"(J1186/80)*100","v":0},{"$f":"(K1186/80)*100","v":0},{"$f":"(L1186/80)*100","v":0},null,null,null,null,{"$f":"1","v":1},{"$f":"1","v":1}]
[null,null,null,null,null,null,"Limiter",{"$f":"IF(H1187>100,\"100\",H1187)","v":0},{"$f":"IF(I1187>100,\"100\",I1187)","v":0},{"$f":"IF(J1187>100,\"100\",J1187)","v":0},{"$f":"IF(K1187>100,\"100\",K1187)","v":0},{"$f":"IF(L1187>100,\"100\",L1187)","v":0},null,null,null,null,{"$f":"1","v":1},{"$f":"1","v":1}]
[null,null,null,null,null,null,null,null,{"$f":"IF(H1188+I1188+J1188+K1188+L1188=0,0,100-(H1188))","v":0},{"$f":"IF(H1188+I1188+J1188+K1188+L1188=0,0,100-(H1188+I1188))","v":0},{"$f":"IF(J1188+I1188+H1188+K1188+L1188=0,0,100-(J1188+I1188+H1188))","v":0},{"$f":"IF(K1188+J1188+I1188+H1188+L1188=0,0,100-(H1188+I1188+K1188+J1188))","v":0},null,null,null,null,{"$f":"1","v":1},{"$f":"1","v":1}]
[null,null,null,null,null,null,null,null,{"$f":"IF(I1188>I1189,I1189,I1188)","v":0},{"$f":"IF(J1188>J1189,J1189,J1188)","v":0},{"$f":"IF(K1188>K1189,K1189,K1188)","v":0},{"$f":"IF(L1188>L1189,L1189,L1188)","v":0},null,null,null,null,{"$f":"1","v":1},{"$f":"1","v":1}]
[null,null,null,null,null,null,null,null,null,null,null,{"$f":"IF(K1190+J1188+H1188+I1188>=100,0,L1190)","v":0},null,null,null,null,{"$f":"1","v":1},{"$f":"1","v":1}]
[null,null,null,null,null,null,"Scores",{"$f":"IF(H1185=0,0,0.01*(H1188*H1193))","v":0},{"$f":"IF(I1185=0,0,0.01*(I1190*I1193))","v":0},{"$f":"IF(J1185=0,0,0.01*(J1190*J1193))","v":0},{"$f":"IF(K1185=0,0,0.01*(K1190*K1193))","v":0},{"$f":"IF(L1185=0,0,0.01*(L1191*L1193))","v":0},null,null,null,null,{"$f":"1","v":1},{"$f":"1","v":1}]
[null,null,null,null,null,null,null,3,2.5,2,1.5,1,"Total",null,null,null,{"$f":"1","v":1},{"$f":"1","v":1}]
[null,null," ANNEN BETYDELIG BRUK (3)",null,null,"Velg datatype:",null,null,null,null,null,null,null,null,null,null,{"$f":"IF(freq15>=5,0,1)","v":1},{"$f":"1","v":1},null,null,{"$f":"IF(G1194=\"\",2,IF(ISERROR(VLOOKUP(G1194,$T$1246:$U$1247,2,FALSE)),\"\",VLOOKUP(G1194,$T$1246:$U$1247,2,FALSE)))","v":2}]
[null,null,null,{"$f":"IF(AND(P1205>=1,type1=1),\"NB! Volum av nivåene kan ikke være større enn det totale volumet for hvert enkelt materiale!\",+IF(AND(P1205>=1,type1=2),\"NB! Prosentandel for hvert nivå må registreres i prosent av det vurderte bygningselementet, og den totale prosentandelen kan ikke være større enn den totale prosent av hvert enkelt materiale!\",\"\"))","v":""},null,null,null,null,null,null,null,null,null,null,null,null,1,{"$f":"1","v":1}]
[null,null,{"$f":"IF(G1194=\"\",\"\",IF(SUM(G1196:G1203)=0,\"\",IF(U1194=1,IF(U1194+L1204=1,\"REGISTRER DET TOTALE VOLUMET AV RELEVANTE MATERIALER\",IF((U1194+G1204+L1204)=1,\"REGISTRER DET TOTALE VOLUMET AV RELEVANTE MATERIALER\",IF(ISERROR(C1205),\"REGISTRER DET TOTALE VOLUMET AV RELEVANTE MATERIALER\",IF(OR(G1196>L1204,G1197>L1204,G1198>L1204,G1199>L1204,G1200>L1204,G1201>L1204,G1202>L1204,G1203>L1204),\"Volumet av de enkelte materialer kan ikke overstige mengden relevante materialer\",IF(SUM(G1196:G1203)>L1204,\"Den totale mengden av materialer kan ikke overstige det  totale volumet av relevante materialer\",\"\"))))),IF(U1194=2,IF(SUM(G1196:G1203)<80,\"Minst 80 % av de relevante materialer må vurderes, vennligst beregn på nytt.\",IF(OR(G1196>100,G1197>100,G1198>100,G1199>100,G1200>100,G1201>100,G1202>100,G1203>100),\"Prosentandel av de enkelte materialerer kan ikke overstige 100\",IF(SUM(G1196:G1203)>100,\"Den totale prosentandelen av materialer kan ikke overstige 100\",\"\")))))))","v":""},null,"Mat. 1",null,null,null,null,null,null,null,{"$f":"IF(SUM(H1212+I1212+J1212+K1212+L1212)>=3,\"3,00\",SUM(H1212+I1212+J1212+K1212+L1212))","v":0},{"$f":"IF(AND(U1194=1,L1204=\"\"),0,IF(OR(NOT(D1195=\"\"),NOT(C1196=\"\"),NOT(N1197=\"\")),0,IF(ISERROR(N1205),\"0\",N1205)))","v":0},null,{"$f":"IF(SUM(H1196:L1196)>G1196,\"1\",\"0\")","v":"0"},1,{"$f":"1","v":1}]
[null,null,null,null,"Mat. 2",null,null,null,null,null,null,null,null,{"$f":"IF(AND(U1194=1,L1204=\"\"),C1196,+IF(G1205>L1204,C1196,(IF(N1205<80,\"Ingen poeng oppnådd,\nmindre enn 80 % oppfyller kravet\",\"\"))))","v":""},null,{"$f":"IF(SUM(H1197:L1197)>G1197,\"1\",\"0\")","v":"0"},1,{"$f":"1","v":1}]
[null,null,null,null,"Mat. 3",null,null,null,null,null,null,null,null,null,null,"0",1,{"$f":"1","v":1}]
[null,null,null,null,"Mat. 4",null,null,null,null,null,null,null,null,null,null,"0",1,{"$f":"1","v":1}]
[null,null,null,null,"Mat. 5",null,null,null,null,null,null,null,null,null,null,"0",1,{"$f":"1","v":1}]
[null,null,null,null,"Mat. 6",null,null,null,null,null,null,null,null,null,null,"0",1,{"$f":"1","v":1}]
[null,null,null,null,"Mat. 7",null,null,null,null,null,null,null,null,null,null,"0",1,{"$f":"1","v":1}]
[null,null,null,null,"Mat. 8",null,null,null,null,null,null,null,null,null,null,"0",1,{"$f":"1","v":1}]
[null,null,null,null,"Totalt % av bygningselementet (relevante materialer) vurdert:",null,{"$f":"IF(U1194=\"\",0,IF(U1194+L1204=1,0,IF(SUM(G1196:G1203)=0,0,IF(U1194=1,IF(OR(G1196>L1204,G1197>L1204,G1198>L1204,G1199>L1204,G1200>L1204,G1201>L1204,G1202>L1204,G1203>L1204,SUM(G1196:G1203)>L1204),0,((SUM(G1196:G1203)/L1204)*100)),IF(U1194=2,IF(OR(G1196>100,G1197>100,G1198>100,G1199>100,G1200>100,G1201>100,G1202>100,G1203>100,SUM(G1196:G1203)>100),0,SUM(G1196:G1203)))))))","v":0},"Samlet volum for aktuelle elementer:",null,null,null,null,null,null,null,null,1,{"$f":"1","v":1}]
[null,null,{"$f":"IF(G1204=0,\"0\",IF(U1194=2,\"0\",IF(U1194=1,(G1204/100)*100,IF(U1194=2,(G1204/100)*100))))","v":"0"},{"$f":"G1204","v":0},null,"Total",{"$f":"IF(SUM(G1196:G1203)=0,\"1\",SUM(G1196:G1203))","v":"1"},{"$f":"SUM(H1196:H1203)","v":0},{"$f":"SUM(I1196:I1203)","v":0},{"$f":"SUM(J1196:J1203)","v":0},{"$f":"SUM(K1196:K1203)","v":0},{"$f":"SUM(L1196:L1203)","v":0},null,{"$f":"SUM(H1206:L1206)","v":0},{"$f":"IF(G1204<80,\"0,00\",IF(P1205>0,\"0\",IF(G1204>100,\"0,00\",IF(N1196>=80,M1196,IF(N1196<80,0)))))","v":"0,00"},{"$f":"P1196+P1197+P1198+P1199+P1200+P1201+P1202+P1203","v":0},{"$f":"1","v":1},{"$f":"1","v":1}]
[null,null,null,null,null,null,"Percentage",{"$f":"IF(H1205+G1205=0,\"0\",(H1205/G1205)*100)","v":0},{"$f":"IF(I1205+G1205=0,\"0\",(I1205/G1205)*100)","v":0},{"$f":"IF(J1205+G1205=0,\"0\",(J1205/G1205)*100)","v":0},{"$f":"IF(K1205+G1205=0,\"0\",(K1205/G1205)*100)","v":0},{"$f":"IF(L1205+G1205=0,\"0\",(L1205/G1205)*100)","v":0},null,100,null,null,{"$f":"1","v":1},{"$f":"1","v":1}]
[null,null,null,null,null,{"$f":"IF(U1194=1,((G1205/100)*80))","v":false},"% of 80",{"$f":"(H1206/80)*100","v":0},{"$f":"(I1206/80)*100","v":0},{"$f":"(J1206/80)*100","v":0},{"$f":"(K1206/80)*100","v":0},{"$f":"(L1206/80)*100","v":0},null,null,null,null,{"$f":"1","v":1},{"$f":"1","v":1}]
[null,null,null,null,null,null,"Limiter",{"$f":"IF(H1207>100,\"100\",H1207)","v":0},{"$f":"IF(I1207>100,\"100\",I1207)","v":0},{"$f":"IF(J1207>100,\"100\",J1207)","v":0},{"$f":"IF(K1207>100,\"100\",K1207)","v":0},{"$f":"IF(L1207>100,\"100\",L1207)","v":0},null,null,null,null,{"$f":"1","v":1},{"$f":"1","v":1}]
[null,null,null,null,null,null,null,null,{"$f":"IF(H1208+I1208+J1208+K1208+L1208=0,0,100-(H1208))","v":0},{"$f":"IF(H1208+I1208+J1208+K1208+L1208=0,0,100-(H1208+I1208))","v":0},{"$f":"IF(J1208+I1208+H1208+K1208+L1208=0,0,100-(J1208+I1208+H1208))","v":0},{"$f":"IF(K1208+J1208+I1208+H1208+L1208=0,0,100-(H1208+I1208+K1208+J1208))","v":0},null,null,null,null,{"$f":"1","v":1},{"$f":"1","v":1}]
[null,null,null,null,null,null,null,null,{"$f":"IF(I1208>I1209,I1209,I1208)","v":0},{"$f":"IF(J1208>J1209,J1209,J1208)","v":0},{"$f":"IF(K1208>K1209,K1209,K1208)","v":0},{"$f":"IF(L1208>L1209,L1209,L1208)","v":0},null,null,null,null,{"$f":"1","v":1},{"$f":"1","v":1}]
[null,null,null,null,null,null,null,null,null,null,null,{"$f":"IF(K1210+J1208+H1208+I1208>=100,0,L1210)","v":0},null,null,null,null,{"$f":"1","v":1},{"$f":"1","v":1}]
[null,null,null,null,null,null,"Scores",{"$f":"IF(H1205=0,0,0.01*(H1208*H1213))","v":0},{"$f":"IF(I1205=0,0,0.01*(I1210*I1213))","v":0},{"$f":"IF(J1205=0,0,0.01*(J1210*J1213))","v":0},{"$f":"IF(K1205=0,0,0.01*(K1210*K1213))","v":0},{"$f":"IF(L1205=0,0,0.01*(L1211*L1213))","v":0},null,null,null,null,{"$f":"1","v":1},{"$f":"1","v":1}]
[null,null,null,null,null,null,null,3,2.5,2,1.5,1,"Total",null,null,null,{"$f":"1","v":1},{"$f":"1","v":1}]
[null,null," ANNEN BETYDELIG BRUK (4)",null,null,"Velg datatype:",null,null,null,null,null,null,null,null,null,null,{"$f":"IF(freq15>=6,0,1)","v":1},{"$f":"1","v":1},null,null,{"$f":"IF(G1214=\"\",2,IF(ISERROR(VLOOKUP(G1214,$T$1246:$U$1247,2,FALSE)),\"\",VLOOKUP(G1214,$T$1246:$U$1247,2,FALSE)))","v":2}]
[null,null,null,{"$f":"IF(AND(P1225>=1,type1=1),\"NB! Volum av nivåene kan ikke være større enn det totale volumet for hvert enkelt materiale!\",+IF(AND(P1225>=1,type1=2),\"NB! Prosentandel for hvert nivå må registreres i prosent av det vurderte bygningselementet, og den totale prosentandelen kan ikke være større enn den totale prosent av hvert enkelt materiale!\",\"\"))","v":""},null,null,null,null,null,null,null,null,null,null,null,null,1,{"$f":"1","v":1}]
[null,null,{"$f":"IF(G1214=\"\",\"\",IF(SUM(G1216:G1223)=0,\"\",IF(U1214=1,IF(U1214+L1224=1,\"REGISTRER DET TOTALE VOLUMET AV RELEVANTE MATERIALER\",IF((U1214+G1224+L1224)=1,\"REGISTRER DET TOTALE VOLUMET AV RELEVANTE MATERIALER\",IF(ISERROR(C1225),\"REGISTRER DET TOTALE VOLUMET AV RELEVANTE MATERIALER\",IF(OR(G1216>L1224,G1217>L1224,G1218>L1224,G1219>L1224,G1220>L1224,G1221>L1224,G1222>L1224,G1223>L1224),\"Volumet av de enkelte materialer kan ikke overstige mengden relevante materialer\",IF(SUM(G1216:G1223)>L1224,\"Den totale mengden av materialer kan ikke overstige det  totale volumet av relevante materialer\",\"\"))))),IF(U1214=2,IF(SUM(G1216:G1223)<80,\"Minst 80 % av de relevante materialer må vurderes, vennligst beregn på nytt.\",IF(OR(G1216>100,G1217>100,G1218>100,G1219>100,G1220>100,G1221>100,G1222>100,G1223>100),\"Prosentandel av de enkelte materialerer kan ikke overstige 100\",IF(SUM(G1216:G1223)>100,\"Den totale prosentandelen av materialer kan ikke overstige 100\",\"\")))))))","v":""},null,"Mat. 1",null,null,null,null,null,null,null,{"$f":"IF(SUM(H1232+I1232+J1232+K1232+L1232)>=3,\"3,00\",SUM(H1232+I1232+J1232+K1232+L1232))","v":0},{"$f":"IF(AND(U1214=1,L1224=\"\"),0,IF(OR(NOT(D1215=\"\"),NOT(C1216=\"\"),NOT(N1217=\"\")),0,IF(ISERROR(N1225),\"0\",N1225)))","v":0},null,{"$f":"IF(SUM(H1216:L1216)>G1216,\"1\",\"0\")","v":"0"},1,{"$f":"1","v":1}]
[null,null,null,null,"Mat. 2",null,null,null,null,null,null,null,null,{"$f":"IF(AND(U1214=1,L1224=\"\"),C1216,+IF(G1225>L1224,C1216,(IF(N1225<80,\"Ingen poeng oppnådd,\nmindre enn 80 % oppfyller kravet\",\"\"))))","v":""},null,{"$f":"IF(SUM(H1217:L1217)>G1217,\"1\",\"0\")","v":"0"},1,{"$f":"1","v":1}]
[null,null,null,null,"Mat. 3",null,null,null,null,null,null,null,null,null,null,"0",1,{"$f":"1","v":1}]
[null,null,null,null,"Mat. 4",null,null,null,null,null,null,null,null,null,null,"0",1,{"$f":"1","v":1}]
[null,null,null,null,"Mat. 5",null,null,null,null,null,null,null,null,null,null,"0",1,{"$f":"1","v":1}]
[null,null,null,null,"Mat. 6",null,null,null,null,null,null,null,null,null,null,"0",1,{"$f":"1","v":1}]
[null,null,null,null,"Mat. 7",null,null,null,null,null,null,null,null,null,null,"0",1,{"$f":"1","v":1}]
[null,null,null,null,"Mat. 8",null,null,null,null,null,null,null,null,null,null,"0",1,{"$f":"1","v":1}]
[null,null,null,null,"Totalt % av bygningselementet (relevante materialer) vurdert:",null,{"$f":"IF(U1214=\"\",0,IF(U1214+L1224=1,0,IF(SUM(G1216:G1223)=0,0,IF(U1214=1,IF(OR(G1216>L1224,G1217>L1224,G1218>L1224,G1219>L1224,G1220>L1224,G1221>L1224,G1222>L1224,G1223>L1224,SUM(G1216:G1223)>L1224),0,((SUM(G1216:G1223)/L1224)*100)),IF(U1214=2,IF(OR(G1216>100,G1217>100,G1218>100,G1219>100,G1220>100,G1221>100,G1222>100,G1223>100,SUM(G1216:G1223)>100),0,SUM(G1216:G1223)))))))","v":0},"Samlet volum for aktuelle elementer:",null,null,null,null,null,null,null,null,1,{"$f":"1","v":1}]
[null,null,{"$f":"IF(G1224=0,\"0\",IF(U1214=2,\"0\",IF(U1214=1,(G1224/100)*100,IF(U1214=2,(G1224/100)*100))))","v":"0"},{"$f":"G1224","v":0},null,"Total",{"$f":"IF(SUM(G1216:G1223)=0,\"1\",SUM(G1216:G1223))","v":"1"},{"$f":"SUM(H1216:H1223)","v":0},{"$f":"SUM(I1216:I1223)","v":0},{"$f":"SUM(J1216:J1223)","v":0},{"$f":"SUM(K1216:K1223)","v":0},{"$f":"SUM(L1216:L1223)","v":0},null,{"$f":"SUM(H1226:L1226)","v":0},{"$f":"IF(G1224<80,\"0,00\",IF(P1225>0,\"0\",IF(G1224>100,\"0,00\",IF(N1216>=80,M1216,IF(N1216<80,0)))))","v":"0,00"},{"$f":"P1216+P1217+P1218+P1219+P1220+P1221+P1222+P1223","v":0},{"$f":"1","v":1},{"$f":"1","v":1}]
[null,null,null,null,null,null,"Percentage",{"$f":"IF(H1225+G1225=0,\"0\",(H1225/G1225)*100)","v":0},{"$f":"IF(I1225+G1225=0,\"0\",(I1225/G1225)*100)","v":0},{"$f":"IF(J1225+G1225=0,\"0\",(J1225/G1225)*100)","v":0},{"$f":"IF(K1225+G1225=0,\"0\",(K1225/G1225)*100)","v":0},{"$f":"IF(L1225+G1225=0,\"0\",(L1225/G1225)*100)","v":0},null,100,null,null,{"$f":"1","v":1},{"$f":"1","v":1}]
[null,null,null,null,null,{"$f":"IF(U1214=1,((G1225/100)*80))","v":false},"% of 80",{"$f":"(H1226/80)*100","v":0},{"$f":"(I1226/80)*100","v":0},{"$f":"(J1226/80)*100","v":0},{"$f":"(K1226/80)*100","v":0},{"$f":"(L1226/80)*100","v":0},null,null,null,null,{"$f":"1","v":1},{"$f":"1","v":1}]
[null,null,null,null,null,null,"Limiter",{"$f":"IF(H1227>100,\"100\",H1227)","v":0},{"$f":"IF(I1227>100,\"100\",I1227)","v":0},{"$f":"IF(J1227>100,\"100\",J1227)","v":0},{"$f":"IF(K1227>100,\"100\",K1227)","v":0},{"$f":"IF(L1227>100,\"100\",L1227)","v":0},null,null,null,null,{"$f":"1","v":1},{"$f":"1","v":1}]
[null,null,null,null,null,null,null,null,{"$f":"IF(H1228+I1228+J1228+K1228+L1228=0,0,100-(H1228))","v":0},{"$f":"IF(H1228+I1228+J1228+K1228+L1228=0,0,100-(H1228+I1228))","v":0},{"$f":"IF(J1228+I1228+H1228+K1228+L1228=0,0,100-(J1228+I1228+H1228))","v":0},{"$f":"IF(K1228+J1228+I1228+H1228+L1228=0,0,100-(H1228+I1228+K1228+J1228))","v":0},null,null,null,null,{"$f":"1","v":1},{"$f":"1","v":1}]
[null,null,null,null,null,null,null,null,{"$f":"IF(I1228>I1229,I1229,I1228)","v":0},{"$f":"IF(J1228>J1229,J1229,J1228)","v":0},{"$f":"IF(K1228>K1229,K1229,K1228)","v":0},{"$f":"IF(L1228>L1229,L1229,L1228)","v":0},null,null,null,null,{"$f":"1","v":1},{"$f":"1","v":1}]
[null,null,null,null,null,null,null,null,null,null,null,{"$f":"IF(K1230+J1228+H1228+I1228>=100,0,L1230)","v":0},null,null,null,null,{"$f":"1","v":1},{"$f":"1","v":1}]
[null,null,null,null,null,null,"Scores",{"$f":"IF(H1225=0,0,0.01*(H1228*H1233))","v":0},{"$f":"IF(I1225=0,0,0.01*(I1230*I1233))","v":0},{"$f":"IF(J1225=0,0,0.01*(J1230*J1233))","v":0},{"$f":"IF(K1225=0,0,0.01*(K1230*K1233))","v":0},{"$f":"IF(L1225=0,0,0.01*(L1231*L1233))","v":0},null,null,null,null,{"$f":"1","v":1},{"$f":"1","v":1}]
[null,null,null,null,null,null,null,3,2.5,2,1.5,1,"Total",null,null,null,{"$f":"1","v":1},{"$f":"1","v":1}]
[null,null,null,null,null,null,null,null,null,null,null,null,null,null,null,null,1,1]
[]
[null,null,null,null,{"$f":"COUNTIF($E$1243:$E$1249,1)","v":0}]
[null,null,null,null,{"$f":"COUNTIF($E$1251:$E$1257,1)","v":0},null,null,null,null,null,null,null,null,null,null,null,null,null,null,"Dropdown data validation:","Lookup for dropdown"]
[null,null,"FOR BOTH NEW BUILD & FIT OUT"]
[null,null,"Present",{"$f":"COUNTIF(D1243:D1257,1)","v":0},"Volume","Points required:","1 Credits","2 credits","3 credits","6 credits","for 8 elements (constant):",null,null,null,null,null,null,null,null,0,2]
[null,null,"Not Present",{"$f":"COUNTIF(D1243:D1257,0)","v":15},"Percentage","(greater than)",{"$f":"IF(D1259=0,0,IF(asstype=3,(D1239/D1259)*9.999,(D1239/D1259)*4.999))","v":0},{"$f":"IF(asstype=2,(D1239/D1259)*9.999,\"\")","v":""},0,0,0,null,null,null,null,null,null,null,null,1,3]
[null,null,null,null,null,null,null,null,null,null,null,null,null,null,null,null,null,null,null,2,4]
[null,null,"total",{"$f":"SUM(D1239:D1240)","v":15},null,null,0,0,null,"Nybygg","Renovering",null,null,null,null,null,null,null,null,3,5]
[null,null,"FRAME",{"$f":"IF(asstype=2,IF(freq1>=3,1,0),0)","v":0},{"$f":"IF(asstype=2,1,0)","v":0},5,{"$f":"G1240","v":0},{"$f":"IF(N10=0,0,IF(J1243=FALSE,K1243,J1243))","v":0},null,{"$f":"IF(asstype=2,IF(N11>=5,1,0))","v":false},{"$f":"IF(asstype=3,IF(N11>=5,1,0))","v":false},null,null,null,null,null,null,null,null,4,6]
[null,null,"GROUND FLOOR",{"$f":"IF(asstype=2,IF(freq2>=3,1,0),0)","v":0},{"$f":"IF(asstype=2,1,0)","v":0},10,{"$f":"H1240","v":""},{"$f":"IF(N10=0,0,IF(J1244=FALSE,K1244,J1244))","v":0},null,{"$f":"IF(asstype=2,IF(N11>=10,2,0))","v":false},{"$f":"IF(asstype=3,IF(N11>=5,1,0))","v":false}]
[null,null,"UPPER FLOORS",{"$f":"IF(asstype=2,IF(freq3>=3,1,0),0)","v":0},0,null,{"$f":"IF(asstype=3,\"N/A\",I1240)","v":0},3]
[null,null,"ROOF",{"$f":"IF(asstype=2,IF(freq4>=3,1,0),0)","v":0},0,null,{"$f":"J1240","v":0},6,null,null,null,null,null,null,null,null,null,null,null,"Volum",1]
[null,null,"EXTERNAL WALLS",{"$f":"IF(asstype=2,IF(freq5>=3,1,0),0)","v":0},0,null,null,null,null,null,null,null,null,null,null,null,null,null,null,"Prosentandel",2]
[null,null,"INTERNAL WALLS",{"$f":"IF(asstype=2,IF(freq6>=3,1,0),0)","v":0},0]
[null,null,"FOUNDATIONS/SUB",{"$f":"IF(asstype=2,IF(freq7>=3,1,0),0)","v":0},0]
[null,null,"STAIRCASE",{"$f":"IF(freq8>=3,1,0)","v":0},{"$f":"1","v":1}]
[null,null,"WINDOWS",{"$f":"IF(asstype=3,IF(freq9>=3,1,0),0)","v":0},{"$f":"IF(asstype=3,1,0)","v":0}]
[null,null,"EXT/INT DOORS",{"$f":"IF(asstype=3,IF(freq10>=3,1,0),0)","v":0},0]
[null,null,"SKIRTING",{"$f":"IF(asstype=3,IF(freq11>=3,1,0),0)","v":0},0]
[null,null,"PANELLING",{"$f":"IF(asstype=3,IF(freq12>=3,1,0),0)","v":0},{"$f":"IF(asstype=3,1,0)","v":0}]
[null,null,"FURNITURE",{"$f":"IF(asstype=3,IF(freq13>=3,1,0),0)","v":0},0]
[null,null,"FASCIAS",{"$f":"IF(asstype=3,IF(freq14>=3,1,0),0)","v":0},0]
[null,null,"OTHER",{"$f":"IF(asstype=3,IF(freq15>=3,1,0),0)","v":0},0]
[]
[null,null,"Total elements of \ntype assessed",{"$f":"SUM(E1243:E1257)","v":1}]

{"sheet":"Ark2","index":1,"n_rows":24,"n_cols":1,"rows_kept":24,"cut":false,"hidden":true,"merged":[]}
["Dialogboks 1"]
["- Murstein (herunder lettklinkerblokk, teglstein og annen keramikk samt mørtel og puss)"]
["- Harpiksbaserte komposittmaterialer og materialer, herunder glassfiberarmert plast"]
["  og polymerpuss"]
["- Betong (herunder prefabrikkert betong og plasstøpt betong, betongblokker,"]
["  belegningsstein, heller, påstøp, osv.)"]
["- Fliser"]
["- Glass"]
["- Plast og gummi (herunder takmembran av EPDM, TPO, PVC og VET"]
[" samt polymerpuss)"]
["- Metaller (stål, aluminium osv.)"]
["- Naturstein, bygningsstein og skifer"]
["- Trevirke, trekompositt og trepaneler (herunder limtre, kryssfiner, OSB, MDF, "]
["  sponplate og sementbundne sponplater)"]
["- Gipsplater og gips"]
["- Isolasjonsmaterialer"]
["- Asfaltholdige materialer som f.eks. takmembraner og asfalt"]
["- Andre mineralbaserte materialer, herunder fibersement og kalsiumsilikat"]
["- Produkter med resirkulert innhold"]
[]
["Merk: Tilbehør, lim og tilsetningsstoffer er ikke tatt med i vurderingen. "]
["For eventuelt andre materialer som utgjør en del av et relevant bygningselement, "]
["men som ikke passer inn i listen over relevante materialer, henvises det til NGBC,"]
["som vil identifisere relevant nøkkelprosess og forsyningskjede eller -kjeder."]

{"sheet":"Schedule of changes","index":3,"n_rows":7,"n_cols":10,"rows_kept":7,"cut":false,"hidden":true,"merged":[[2,6,2,9]]}
[null,"Schedule of Changes to the Mat 5 Spreadsheet tool"]
[]
[null,null,null,null,null,null,"Schemes affected by change"]
[null,null,"Previous rev no.","New rev. No.","Date","Description of change/amendment to previous rev no.","Industrial","Offices","Retail","Education"]
[null,null,"rev 01","rev 02","2013-05-10","Green guide preset options have been removed due to compatability issues with excel. ","Yes","Yes","Yes"]
[null,null,"rev 02","rev 03","2013-05-20","Updates made to buttons due to compatability issues with Excel","Yes","Yes","Yes"]
[null,null,"rev 03","Versjon 1.0","2013-07-01","Tilpasset norsk Teknisk manual versjon 1.0 v/Arne Hammerstad, Norsk Byggtjeneste","Yes","Yes","Yes","Yes"]